Date | Level | Type | Message |
---|---|---|---|
2025-02-13 17:22:32 | INFO | runbot | Init build environment with config Adhoc Conf for demo (y personalizaciones) 17+ |
2025-02-13 17:22:32 | Starting step all_no_test from config Adhoc Conf for demo (y personalizaciones) 17+ | ||
2025-02-13 17:22:32 | INFO | runbot | Using Dockerfile Tag odoo:adhoc-odoo-18 |
2025-02-13 17:23:16 | INFO | server | odoo.modules.loading:329 1 modules loaded in 12.14s, 9222 queries (+9222 extra) |
2025-02-13 17:28:23 | INFO | server | odoo.addons.l10n_ar_edi.models.res_company:128 Setting demo certificate from False to AR demo certificate 7 in (AR) Responsable Inscripto company |
2025-02-13 17:28:23 | INFO | server | odoo.addons.l10n_ar_edi.models.res_company:128 Setting demo certificate from False to AR demo certificate 5 in (AR) Monotributista company |
2025-02-13 17:28:23 | INFO | server | odoo.addons.l10n_ar_edi.models.res_company:128 Setting demo certificate from False to AR demo certificate 10 in (AR) Exento company |
2025-02-13 17:29:12 | INFO | server | odoo.addons.l10n_ar_currency_update.models.res_company:36 Currency Provider configured as AFIP for next companies: (AR) Exento, (AR) Monotributista, (AR) Responsable Inscripto |
2025-02-13 17:29:35 | INFO | server | odoo.addons.l10n_ar_currency_update.models.res_company:36 Currency Provider configured as AFIP for next companies: (AR) Exento, (AR) Monotributista, Muebleria ARG |
2025-02-13 17:31:01 | INFO | server | odoo.modules.loading:329 252 modules loaded in 458.32s, 194705 queries (+194754 extra) |
2025-02-13 17:31:01 | INFO | server | odoo.modules.loading:329 253 modules loaded in 0.92s, 290 queries (+290 extra) |
2025-02-13 17:31:13 | Step all_no_test finished in 9m | ||
2025-02-13 17:31:13 | Starting step setup from config Adhoc Conf for demo (y personalizaciones) 17+ | ||
2025-02-13 17:31:13 | INFO | runbot | Using Dockerfile Tag odoo:adhoc-odoo-18 |
2025-02-13 17:31:14 | INFO | runbot | Step setup finished in 1s |
2025-02-13 17:31:14 | Starting step run from config Adhoc Conf for demo (y personalizaciones) 17+ | ||
2025-02-13 17:31:14 | INFO | runbot | Start running build 124013-18-0 |
2025-02-13 17:31:15 | INFO | runbot | Using Dockerfile Tag odoo:adhoc-odoo-18 |
2025-02-13 17:31:18 | INFO | server | odoo.modules.loading:329 1 modules loaded in 0.01s, 0 queries (+0 extra) |
2025-02-13 17:31:24 | INFO | server | odoo.modules.loading:329 253 modules loaded in 3.88s, 0 queries (+0 extra) |
2025-02-13 17:31:31 | ERROR | server |
odoo.addons.mail.models.mail_mail:266
Failed processing mail queue Traceback (most recent call last): File "/data/build/adhoc-cicd-odoo-odoo/addons/mail/models/mail_mail.py", line 264, in process_email_queue res = self.browse(send_ids).send(auto_commit=auto_commit, post_send_callback=post_send_callback) TypeError: MailMail.send() got an unexpected keyword argument 'post_send_callback' |
2025-02-13 18:24:33 | ERROR | server |
odoo.addons.mail.models.mail_mail:266
Failed processing mail queue Traceback (most recent call last): File "/data/build/adhoc-cicd-odoo-odoo/addons/mail/models/mail_mail.py", line 264, in process_email_queue res = self.browse(send_ids).send(auto_commit=auto_commit, post_send_callback=post_send_callback) TypeError: MailMail.send() got an unexpected keyword argument 'post_send_callback' |
2025-02-13 19:24:15 | ERROR | server |
odoo.addons.mail.models.mail_mail:266
Failed processing mail queue Traceback (most recent call last): File "/data/build/adhoc-cicd-odoo-odoo/addons/mail/models/mail_mail.py", line 264, in process_email_queue res = self.browse(send_ids).send(auto_commit=auto_commit, post_send_callback=post_send_callback) TypeError: MailMail.send() got an unexpected keyword argument 'post_send_callback' |
2025-02-13 20:23:41 | ERROR | server |
odoo.addons.mail.models.mail_mail:266
Failed processing mail queue Traceback (most recent call last): File "/data/build/adhoc-cicd-odoo-odoo/addons/mail/models/mail_mail.py", line 264, in process_email_queue res = self.browse(send_ids).send(auto_commit=auto_commit, post_send_callback=post_send_callback) TypeError: MailMail.send() got an unexpected keyword argument 'post_send_callback' |
2025-02-13 21:24:22 | ERROR | server |
odoo.addons.mail.models.mail_mail:266
Failed processing mail queue Traceback (most recent call last): File "/data/build/adhoc-cicd-odoo-odoo/addons/mail/models/mail_mail.py", line 264, in process_email_queue res = self.browse(send_ids).send(auto_commit=auto_commit, post_send_callback=post_send_callback) TypeError: MailMail.send() got an unexpected keyword argument 'post_send_callback' |
2025-02-13 22:24:06 | ERROR | server |
odoo.addons.mail.models.mail_mail:266
Failed processing mail queue Traceback (most recent call last): File "/data/build/adhoc-cicd-odoo-odoo/addons/mail/models/mail_mail.py", line 264, in process_email_queue res = self.browse(send_ids).send(auto_commit=auto_commit, post_send_callback=post_send_callback) TypeError: MailMail.send() got an unexpected keyword argument 'post_send_callback' |
2025-02-13 23:24:03 | ERROR | server |
odoo.addons.mail.models.mail_mail:266
Failed processing mail queue Traceback (most recent call last): File "/data/build/adhoc-cicd-odoo-odoo/addons/mail/models/mail_mail.py", line 264, in process_email_queue res = self.browse(send_ids).send(auto_commit=auto_commit, post_send_callback=post_send_callback) TypeError: MailMail.send() got an unexpected keyword argument 'post_send_callback' |
2025-02-14 00:23:59 | ERROR | server |
odoo.addons.mail.models.mail_mail:266
Failed processing mail queue Traceback (most recent call last): File "/data/build/adhoc-cicd-odoo-odoo/addons/mail/models/mail_mail.py", line 264, in process_email_queue res = self.browse(send_ids).send(auto_commit=auto_commit, post_send_callback=post_send_callback) TypeError: MailMail.send() got an unexpected keyword argument 'post_send_callback' |
2025-02-14 01:23:53 | ERROR | server |
odoo.addons.mail.models.mail_mail:266
Failed processing mail queue Traceback (most recent call last): File "/data/build/adhoc-cicd-odoo-odoo/addons/mail/models/mail_mail.py", line 264, in process_email_queue res = self.browse(send_ids).send(auto_commit=auto_commit, post_send_callback=post_send_callback) TypeError: MailMail.send() got an unexpected keyword argument 'post_send_callback' |
2025-02-14 02:24:02 | ERROR | server |
odoo.addons.mail.models.mail_mail:266
Failed processing mail queue Traceback (most recent call last): File "/data/build/adhoc-cicd-odoo-odoo/addons/mail/models/mail_mail.py", line 264, in process_email_queue res = self.browse(send_ids).send(auto_commit=auto_commit, post_send_callback=post_send_callback) TypeError: MailMail.send() got an unexpected keyword argument 'post_send_callback' |
2025-02-14 03:23:50 | ERROR | server |
odoo.addons.mail.models.mail_mail:266
Failed processing mail queue Traceback (most recent call last): File "/data/build/adhoc-cicd-odoo-odoo/addons/mail/models/mail_mail.py", line 264, in process_email_queue res = self.browse(send_ids).send(auto_commit=auto_commit, post_send_callback=post_send_callback) TypeError: MailMail.send() got an unexpected keyword argument 'post_send_callback' |
2025-02-14 04:23:43 | ERROR | server |
odoo.addons.mail.models.mail_mail:266
Failed processing mail queue Traceback (most recent call last): File "/data/build/adhoc-cicd-odoo-odoo/addons/mail/models/mail_mail.py", line 264, in process_email_queue res = self.browse(send_ids).send(auto_commit=auto_commit, post_send_callback=post_send_callback) TypeError: MailMail.send() got an unexpected keyword argument 'post_send_callback' |
2025-02-14 05:24:42 | ERROR | server |
odoo.addons.base.models.ir_cron:580
Job 'Saas Client Database Backup' (14) server action #238 failed Traceback (most recent call last): File "/data/build/adhoc-cicd-odoo-odoo/odoo/addons/base/models/ir_cron.py", line 570, in _callback self.env['ir.actions.server'].browse(server_action_id).run() File "/data/build/adhoc-cicd-odoo-odoo/odoo/addons/base/models/ir_actions.py", line 995, in run res = runner(run_self, eval_context=eval_context) File "/data/build/adhoc-cicd-odoo-odoo/addons/website/models/ir_actions_server.py", line 60, in _run_action_code_multi res = super(ServerAction, self)._run_action_code_multi(eval_context) File "/data/build/adhoc-cicd-odoo-odoo/odoo/addons/base/models/ir_actions.py", line 827, in _run_action_code_multi safe_eval(self.code.strip(), eval_context, mode="exec", nocopy=True, filename=str(self)) # nocopy allows to return 'action' File "/data/build/adhoc-cicd-odoo-odoo/odoo/tools/safe_eval.py", line 390, in safe_eval return unsafe_eval(c, globals_dict, locals_dict) File "ir.actions.server(238,)", line 1, in <module> File "/data/build/ingadhoc-ingadhoc-odoo-saas/saas_client/wizards/saas_client_dashboard.py", line 60, in cron_backup_database self.backup_database() File "/data/build/ingadhoc-ingadhoc-odoo-saas/saas_client/wizards/saas_client_dashboard.py", line 90, in backup_database storage_type = self.get_bucket_type() File "/data/build/ingadhoc-ingadhoc-odoo-saas/saas_client/wizards/saas_client_dashboard.py", line 39, in get_bucket_type raise ValidationError(_("No hay bucket configurado")) odoo.exceptions.ValidationError: No hay bucket configurado |
2025-02-14 05:24:42 | ERROR | server |
odoo.addons.mail.models.mail_mail:266
Failed processing mail queue Traceback (most recent call last): File "/data/build/adhoc-cicd-odoo-odoo/addons/mail/models/mail_mail.py", line 264, in process_email_queue res = self.browse(send_ids).send(auto_commit=auto_commit, post_send_callback=post_send_callback) TypeError: MailMail.send() got an unexpected keyword argument 'post_send_callback' |
2025-02-14 06:24:34 | ERROR | server |
odoo.addons.mail.models.mail_mail:266
Failed processing mail queue Traceback (most recent call last): File "/data/build/adhoc-cicd-odoo-odoo/addons/mail/models/mail_mail.py", line 264, in process_email_queue res = self.browse(send_ids).send(auto_commit=auto_commit, post_send_callback=post_send_callback) TypeError: MailMail.send() got an unexpected keyword argument 'post_send_callback' |
2025-02-14 07:24:22 | ERROR | server |
odoo.addons.mail.models.mail_mail:266
Failed processing mail queue Traceback (most recent call last): File "/data/build/adhoc-cicd-odoo-odoo/addons/mail/models/mail_mail.py", line 264, in process_email_queue res = self.browse(send_ids).send(auto_commit=auto_commit, post_send_callback=post_send_callback) TypeError: MailMail.send() got an unexpected keyword argument 'post_send_callback' |
2025-02-14 08:24:16 | ERROR | server |
odoo.addons.mail.models.mail_mail:266
Failed processing mail queue Traceback (most recent call last): File "/data/build/adhoc-cicd-odoo-odoo/addons/mail/models/mail_mail.py", line 264, in process_email_queue res = self.browse(send_ids).send(auto_commit=auto_commit, post_send_callback=post_send_callback) TypeError: MailMail.send() got an unexpected keyword argument 'post_send_callback' |
2025-02-14 09:24:09 | ERROR | server |
odoo.addons.mail.models.mail_mail:266
Failed processing mail queue Traceback (most recent call last): File "/data/build/adhoc-cicd-odoo-odoo/addons/mail/models/mail_mail.py", line 264, in process_email_queue res = self.browse(send_ids).send(auto_commit=auto_commit, post_send_callback=post_send_callback) TypeError: MailMail.send() got an unexpected keyword argument 'post_send_callback' |
2025-02-14 10:23:38 | ERROR | server |
odoo.addons.mail.models.mail_mail:266
Failed processing mail queue Traceback (most recent call last): File "/data/build/adhoc-cicd-odoo-odoo/addons/mail/models/mail_mail.py", line 264, in process_email_queue res = self.browse(send_ids).send(auto_commit=auto_commit, post_send_callback=post_send_callback) TypeError: MailMail.send() got an unexpected keyword argument 'post_send_callback' |
2025-02-14 11:24:06 | ERROR | server |
odoo.addons.mail.models.mail_mail:266
Failed processing mail queue Traceback (most recent call last): File "/data/build/adhoc-cicd-odoo-odoo/addons/mail/models/mail_mail.py", line 264, in process_email_queue res = self.browse(send_ids).send(auto_commit=auto_commit, post_send_callback=post_send_callback) TypeError: MailMail.send() got an unexpected keyword argument 'post_send_callback' |
2025-02-14 12:05:54 | INFO | runbot | Kill build 124013-18-0 |