Description: Odoo By Adhoc 18
Commit: ingadhoc-ingadhoc-odoo-saas:6a51a81e  
Subject: [IMP] saas_k8s change default install time out
Author: Andrés Zacchino
Committer: Virginia Bonservizi
Commit: ingadhoc-ingadhoc-odoo-saas-adhoc2:eb267bd2  
Subject: [I18N] Update translation terms from Transifex adhoc-odoo-18-0
Author: ADHOC - Bot
Committer: ADHOC - Bot
Commit: ingadhoc-sale:ffbd3bfa  
Subject: [I18N] Update translation terms from Transifex adhoc-odoo-18-0
Author: ADHOC - Bot
Committer: ADHOC - Bot
Commit: ingadhoc-purchase:5060bcdd  
Subject: [I18N] Update translation terms from Transifex adhoc-odoo-18-0
Author: ADHOC - Bot
Committer: ADHOC - Bot
Commit: ingadhoc-product:4bedb335  
Subject: [I18N] Update translation terms from Transifex adhoc-odoo-18-0
Author: ADHOC - Bot
Committer: ADHOC - Bot
Commit: ingadhoc-odoo-argentina:44909496  
Subject: [I18N] Update translation terms from Transifex adhoc-odoo-18-0
Author: ADHOC - Bot
Committer: ADHOC - Bot
Commit: ingadhoc-enterprise-extensions:37037612  
Subject: [I18N] Update translation terms from Transifex adhoc-odoo-18-0
Author: ADHOC - Bot
Committer: ADHOC - Bot
Commit: ingadhoc-account-payment:12c7b6b1  
Subject: [I18N] Update translation terms from Transifex adhoc-odoo-18-0
Author: ADHOC - Bot
Committer: ADHOC - Bot
Commit: ingadhoc-account-financial-tools:3f49a034  
Subject: [I18N] Update translation terms from Transifex adhoc-odoo-18-0
Author: ADHOC - Bot
Committer: ADHOC - Bot
Commit: ingadhoc-odoo-argentina-ee:cde4e282  
Subject: [FIX] account_tax_settlement: Preserve skip_invoice_sync context to prevent dynamic journal item lines when modifying entries
Author: Rocío Vega
Committer: Rocío Vega
Commit: ingadhoc-miscellaneous:54f7ccce  
Subject: [FIX]mail_ux: send email duplicate fixed
Author: Matias Peralta
Committer: Matias Peralta
Commit: plugberry-pagos360:fa3573e9  
Subject: [FIX] Fix envent type request page size
Author: Martin Quinteros
Committer: Martin Quinteros
Commit: ingadhoc-stock:65161f8e  
Subject: [FIX]stock_picking_state: domain for state_detail_id in tree view
Author: mav-adhoc
Committer: mav-adhoc
Commit: ingadhoc-account-invoicing:049c4f60  
Subject: [I18N] Update translation terms from Transifex adhoc-odoo-18-0
Author: ADHOC - Bot
Committer: ADHOC - Bot
Commit: ingadhoc-argentina-sale:35c06e07  
Subject: [FIX] l10n_ar_sale: Fix in l10n_ar_sale_templates view preserved odoo ids
Author: Rocío Vega
Committer: Rocío Vega
Commit: ingadhoc-ingadhoc-demo:73c358f1  
Subject: [FIX] demo_base_minimal: warning de runbot
Author: Julia Elizondo
Committer: Julia Elizondo
Commit: plugberry-payment:2304ac7d  
Subject: [FIX] payment_redpagos: invoice date due
Author: augusto-weiss
Committer: augusto-weiss
Commit: ingadhoc-hr:95b987c3  
Subject: [I18N] Update translation terms from Transifex adhoc-odoo-18-0
Author: ADHOC - Bot
Committer: ADHOC - Bot
Commit: ingadhoc-website:78d548da  
Subject: [IMP] website: pre-commit improvements
Author: Virginia
Committer: Virginia Bonservizi
Commit: ingadhoc-uruguay:60cc3781  
Subject: [IMP] uruguay: pre-commit improvements
Author: Virginia
Committer: Virginia Bonservizi
Commit: ingadhoc-project:1a0a867c  
Subject: [IMP] project: pre-commit improvements
Author: Virginia
Committer: Virginia Bonservizi
Commit: ingadhoc-multi-store:b6386585  
Subject: [IMP] multi-store: pre-commit improvements
Author: Virginia
Committer: Virginia Bonservizi
Commit: ingadhoc-multi-company:75eb8ddd  
Subject: [IMP] multi-company: pre-commit improvements
Author: Virginia
Committer: Virginia Bonservizi
Commit: ingadhoc-delivery:a72f974c  
Subject: [IMP] delivery: pre-commit improvements
Author: Virginia
Committer: Virginia Bonservizi
Commit: ingadhoc-aeroo_reports:f1c65f31  
Subject: [IMP] aeroo_reports: pre-commit improvements
Author: Virginia
Committer: Virginia Bonservizi
Commit: ingadhoc-partner:88d4b5d3  
Subject: [IMP] partner: pre-commit improvements
Author: Virginia
Committer: Virginia
Commit: ingadhoc-third-party-apps:c527084a  
Subject: [IMP] ks_dashboard_ninja: new release 1.1
Author: Matias Peralta
Committer: Matias Peralta
Commit: adhoc-cicd-oca-pos1:cebdb9b7  
Subject: [IMP] update dotfiles
Author: oca-git-bot
Committer: oca-git-bot
Commit: plugberry-mercadopago:85d35ad5  
Subject: [UPD] Initialize version 18.0
Author: Diego Bollini
Committer: Diego Bollini
Commit: adhoc-cicd-odoo-enterprise:20e40443  
Subject: Merge commit 'refs/pull/77062/head' of github.com:odoo/enterprise into 18.0-13165
Author: adhoc-cicd-bot
Committer: adhoc-cicd-bot
Commit: adhoc-cicd-oca-server-tools:b0399e59  
Subject: Merge commit 'refs/pull/3201/head' of github.com:oca/server-tools into 18.0-13168
Author: adhoc-cicd-bot
Committer: adhoc-cicd-bot
Commit: adhoc-cicd-oca-mis-builder:c0a5cd06  
Subject: [IMP] update dotfiles
Author: oca-git-bot
Committer: oca-git-bot
Commit: adhoc-cicd-oca-hr-holidays:58fb6833  
Subject: [IMP] update dotfiles
Author: oca-git-bot
Committer: oca-git-bot
Commit: adhoc-cicd-oca-report-print-send:ea9336ad  
Subject: [BOT] post-merge updates
Author: OCA-git-bot
Committer: OCA-git-bot
Commit: adhoc-cicd-oca-sale-workflow:9a9bfcb0  
Subject: Merge commit 'refs/pull/3394/head' of github.com:oca/sale-workflow into 18.0-13147
Author: adhoc-cicd-bot
Committer: adhoc-cicd-bot
Commit: adhoc-cicd-oca-web:e00f2f58  
Subject: [BOT] post-merge updates
Author: OCA-git-bot
Committer: OCA-git-bot
Commit: adhoc-cicd-oca-stock-logistics-barcode:0f1ad1a8  
Subject: Merge pull request #673 from jbaudoux/18-readme-guideline
Author: Jacques-Etienne Baudoux
Committer: GitHub
Commit: adhoc-cicd-oca-social:374ea96c  
Subject: [BOT] add or update setup/_metapackage
Author: OCA-git-bot
Committer: OCA-git-bot
Commit: adhoc-cicd-oca-survey:b5eecc7e  
Subject: Update translation files
Author: Weblate
Committer: Weblate
Commit: adhoc-cicd-oca-stock-logistics-availability:b52d1e53  
Subject: Translated using Weblate (Italian)
Author: mymage
Committer: Weblate
Commit: adhoc-cicd-oca-stock-logistics-request:1e4a2631  
Subject: Merge commit 'refs/pull/51/head' of github.com:oca/stock-logistics-request into 18.0-13194
Author: adhoc-cicd-bot
Committer: adhoc-cicd-bot
Commit: adhoc-cicd-oca-website:1e0fd67b  
Subject: Merge commit 'refs/pull/1064/head' of github.com:oca/website into 18.0-13199
Author: adhoc-cicd-bot
Committer: adhoc-cicd-bot
Commit: adhoc-cicd-oca-stock-logistics-warehouse:64024010  
Subject: Merge commit 'refs/pull/2209/head' of github.com:oca/stock-logistics-warehouse into 18.0-13195
Author: adhoc-cicd-bot
Committer: adhoc-cicd-bot
Commit: adhoc-cicd-oca-timesheet:5b28fcf1  
Subject: [BOT] post-merge updates
Author: OCA-git-bot
Committer: OCA-git-bot
Commit: adhoc-cicd-oca-stock-logistics-workflow:eb287bb0  
Subject: [BOT] post-merge updates
Author: OCA-git-bot
Committer: OCA-git-bot
Commit: adhoc-cicd-oca-account-analytic:82d5ab7f  
Subject: [BOT] post-merge updates
Author: OCA-git-bot
Committer: OCA-git-bot
Commit: adhoc-cicd-oca-account-reconcile:8de3e448  
Subject: [BOT] post-merge updates
Author: OCA-git-bot
Committer: OCA-git-bot
Commit: adhoc-cicd-oca-knowledge:1f2d1d6d  
Subject: [BOT] post-merge updates
Author: OCA-git-bot
Committer: OCA-git-bot
Commit: adhoc-cicd-oca-brand:d9e20965  
Subject: [BOT] post-merge updates
Author: OCA-git-bot
Committer: OCA-git-bot
Commit: adhoc-cicd-oca-partner-contact:fe60ac65  
Subject: [BOT] post-merge updates
Author: OCA-git-bot
Committer: OCA-git-bot
Commit: adhoc-cicd-oca-hr-expense:7bb4fc13  
Subject: Merge commit 'refs/pull/282/head' of github.com:oca/hr-expense into 18.0-13159
Author: adhoc-cicd-bot
Committer: adhoc-cicd-bot
Commit: adhoc-cicd-oca-account-invoicing:66f1398e  
Subject: [BOT] post-merge updates
Author: OCA-git-bot
Committer: OCA-git-bot
Commit: adhoc-cicd-oca-bank-statement-import:79176c8f  
Subject: Merge commit 'refs/pull/747/head' of github.com:oca/bank-statement-import into 18.0-13177
Author: adhoc-cicd-bot
Committer: adhoc-cicd-bot
Commit: adhoc-cicd-oca-e-commerce:68bb54c2  
Subject: Merge commit 'refs/pull/981/head' of github.com:oca/e-commerce into 18.0-13180
Author: adhoc-cicd-bot
Committer: adhoc-cicd-bot
Commit: adhoc-cicd-oca-crm:08c6163a  
Subject: [BOT] post-merge updates
Author: OCA-git-bot
Committer: OCA-git-bot
Commit: adhoc-cicd-oca-server-ux:0cc219fd  
Subject: Merge commit 'refs/pull/969/head' of github.com:oca/server-ux into 18.0-13205
Author: adhoc-cicd-bot
Committer: adhoc-cicd-bot
Commit: adhoc-cicd-oca-management-system:2e36d04b  
Subject: Translated using Weblate (Italian)
Author: mymage
Committer: Weblate
Commit: adhoc-cicd-oca-manufacture:7ed57a09  
Subject: Translated using Weblate (Spanish)
Author: Isneyler Mosquera Preciado
Committer: Weblate
Commit: adhoc-cicd-oca-product-attribute:662a5a92  
Subject: Merge commit 'refs/pull/1771/head' of github.com:oca/product-attribute into 18.0-13160
Author: adhoc-cicd-bot
Committer: adhoc-cicd-bot
Commit: adhoc-cicd-odoo-odoo:2baa02f4  
Subject: Merge commit 'refs/pull/184132/head' of github.com:odoo/odoo into 18.0-13164
Author: adhoc-cicd-bot
Committer: adhoc-cicd-bot
Commit: adhoc-cicd-odoo-design-themes:9e59bec5  
Subject: [I18N] *: fetch 18.0 translations
Author: Odoo Translation Bot
Committer: Odoo Translation Bot
Commit: adhoc-cicd-oca-product-pack:84f14917  
Subject: Merge commit 'refs/pull/193/head' of github.com:oca/product-pack into 18.0-13161
Author: adhoc-cicd-bot
Committer: adhoc-cicd-bot
Commit: adhoc-cicd-oca-project:e4dbe50e  
Subject: [BOT] post-merge updates
Author: OCA-git-bot
Committer: OCA-git-bot
Commit: adhoc-cicd-oca-hr:be995c21  
Subject: Update translation files
Author: Weblate
Committer: Weblate
Commit: adhoc-cicd-oca-server-backend:cafbb714  
Subject: [BOT] post-merge updates
Author: OCA-git-bot
Committer: OCA-git-bot
Commit: adhoc-cicd-oca-server-auth:4eb0e37d  
Subject: Merge commit 'refs/pull/727/head' of github.com:oca/server-auth into 18.0-13190
Author: adhoc-cicd-bot
Committer: adhoc-cicd-bot
Commit: adhoc-cicd-oca-reporting-engine:7c5aeee7  
Subject: Merge commit 'refs/pull/948/head' of github.com:oca/reporting-engine into 18.0-13189
Author: adhoc-cicd-bot
Committer: adhoc-cicd-bot
Commit: adhoc-cicd-oca-purchase-workflow:5a147e1e  
Subject: [BOT] post-merge updates
Author: OCA-git-bot
Committer: OCA-git-bot
Commit: adhoc-cicd-oca-mail:d4b5f80d  
Subject: Translated using Weblate (German)
Author: Nils Coenen
Committer: Weblate
Version: 18.0
Config: Adhoc Conf con tests 17+
Total time: 17m
Date Level Type Message
2025-03-25 12:37:42 INFO runbot Init build environment with config Adhoc Conf con tests 17+
2025-03-25 12:37:42 Starting step base from config Adhoc Conf con tests 17+
2025-03-25 12:37:42 INFO runbot Using Dockerfile Tag odoo:adhoc-odoo-18
2025-03-25 12:38:03 INFO server odoo.modules.loading:357 1 modules loaded in 8.37s, 9225 queries (+9225 extra)
2025-03-25 12:38:09 INFO server odoo.modules.loading:357 19 modules loaded in 5.94s, 7938 queries (+7938 extra)
2025-03-25 12:38:09 Step base finished in 26s
2025-03-25 12:38:09 Starting step all from config Adhoc Conf con tests 17+
2025-03-25 12:38:09 INFO runbot Using Dockerfile Tag odoo:adhoc-odoo-18
2025-03-25 12:38:32 INFO server odoo.modules.loading:357 1 modules loaded in 9.46s, 9225 queries (+9225 extra)
2025-03-25 12:44:07 WARNING server odoo.modules.loading:94
Module l10n_ar demo data failed to install, installed without demo data
Traceback (most recent call last):
  File "/data/build/adhoc-cicd-odoo-odoo/odoo/tools/convert.py", line 537, in _tag_root
    f(rec)
  File "/data/build/adhoc-cicd-odoo-odoo/odoo/tools/convert.py", line 261, in _tag_function
    _eval_xml(self, rec, env)
  File "/data/build/adhoc-cicd-odoo-odoo/odoo/tools/convert.py", line 188, in _eval_xml
    return odoo.api.call_kw(model, method_name, args, kwargs)
  File "/data/build/adhoc-cicd-odoo-odoo/odoo/api.py", line 533, in call_kw
    result = getattr(recs, name)(*args, **kwargs)
  File "/data/build/adhoc-cicd-odoo-odoo/addons/l10n_ar/models/account_chart_template.py", line 60, in try_loading
    return super().try_loading(template_code, company, install_demo, force_create)
  File "/data/build/adhoc-cicd-odoo-odoo/addons/account/models/chart_template.py", line 160, in try_loading
    return self._load(template_code, company, install_demo, force_create)
  File "/data/build/adhoc-cicd-odoo-odoo/addons/l10n_ar/models/account_chart_template.py", line 39, in _load
    res = super()._load(template_code, company, install_demo,force_create)
TypeError: AccountChartTemplate._load() takes 4 positional arguments but 5 were given
The above exception was the direct cause of the following exception:
Traceback (most recent call last):
  File "/data/build/adhoc-cicd-odoo-odoo/odoo/modules/loading.py", line 90, in load_demo
    load_data(env(su=True), idref, mode, kind='demo', package=package)
  File "/data/build/adhoc-cicd-odoo-odoo/odoo/modules/loading.py", line 72, in load_data
    tools.convert_file(env, package.name, filename, idref, mode, noupdate, kind)
  File "/data/build/adhoc-cicd-odoo-odoo/odoo/tools/convert.py", line 608, in convert_file
    convert_xml_import(env, module, fp, idref, mode, noupdate)
  File "/data/build/adhoc-cicd-odoo-odoo/odoo/tools/convert.py", line 679, in convert_xml_import
    obj.parse(doc.getroot())
  File "/data/build/adhoc-cicd-odoo-odoo/odoo/tools/convert.py", line 594, in parse
    self._tag_root(de)
  File "/data/build/adhoc-cicd-odoo-odoo/odoo/tools/convert.py", line 550, in _tag_root
    raise ParseError('while parsing %s:%s, somewhere inside\n%s' % (
odoo.tools.convert.ParseError: while parsing /data/build/adhoc-cicd-odoo-odoo/addons/l10n_ar/demo/exento_demo.xml:32, somewhere inside
<function model="account.chart.template" name="try_loading">
        <value eval="[]"/>
        <value>ar_ex</value>
        <value model="res.company" eval="obj().env.ref('base.company_exento')"/>
        <value name="install_demo" eval="True"/>
    </function>
2025-03-25 12:44:13 WARNING server odoo.modules.loading:94
Module l10n_cl demo data failed to install, installed without demo data
Traceback (most recent call last):
  File "/data/build/adhoc-cicd-odoo-odoo/odoo/tools/convert.py", line 537, in _tag_root
    f(rec)
  File "/data/build/adhoc-cicd-odoo-odoo/odoo/tools/convert.py", line 261, in _tag_function
    _eval_xml(self, rec, env)
  File "/data/build/adhoc-cicd-odoo-odoo/odoo/tools/convert.py", line 188, in _eval_xml
    return odoo.api.call_kw(model, method_name, args, kwargs)
  File "/data/build/adhoc-cicd-odoo-odoo/odoo/api.py", line 533, in call_kw
    result = getattr(recs, name)(*args, **kwargs)
  File "/data/build/adhoc-cicd-odoo-odoo/addons/l10n_ar/models/account_chart_template.py", line 60, in try_loading
    return super().try_loading(template_code, company, install_demo, force_create)
  File "/data/build/adhoc-cicd-odoo-odoo/addons/account/models/chart_template.py", line 160, in try_loading
    return self._load(template_code, company, install_demo, force_create)
  File "/data/build/adhoc-cicd-odoo-odoo/addons/l10n_ar/models/account_chart_template.py", line 39, in _load
    res = super()._load(template_code, company, install_demo,force_create)
TypeError: AccountChartTemplate._load() takes 4 positional arguments but 5 were given
The above exception was the direct cause of the following exception:
Traceback (most recent call last):
  File "/data/build/adhoc-cicd-odoo-odoo/odoo/modules/loading.py", line 90, in load_demo
    load_data(env(su=True), idref, mode, kind='demo', package=package)
  File "/data/build/adhoc-cicd-odoo-odoo/odoo/modules/loading.py", line 72, in load_data
    tools.convert_file(env, package.name, filename, idref, mode, noupdate, kind)
  File "/data/build/adhoc-cicd-odoo-odoo/odoo/tools/convert.py", line 608, in convert_file
    convert_xml_import(env, module, fp, idref, mode, noupdate)
  File "/data/build/adhoc-cicd-odoo-odoo/odoo/tools/convert.py", line 679, in convert_xml_import
    obj.parse(doc.getroot())
  File "/data/build/adhoc-cicd-odoo-odoo/odoo/tools/convert.py", line 594, in parse
    self._tag_root(de)
  File "/data/build/adhoc-cicd-odoo-odoo/odoo/tools/convert.py", line 550, in _tag_root
    raise ParseError('while parsing %s:%s, somewhere inside\n%s' % (
odoo.tools.convert.ParseError: while parsing /data/build/adhoc-cicd-odoo-odoo/addons/l10n_cl/demo/demo_company.xml:33, somewhere inside
<function model="account.chart.template" name="try_loading">
        <value eval="[]"/>
        <value>cl</value>
        <value model="res.company" eval="obj().env.ref('base.demo_company_cl')"/>
        <value name="install_demo" eval="True"/>
    </function>
2025-03-25 12:44:18 WARNING server odoo.modules.loading:94
Module l10n_pe demo data failed to install, installed without demo data
Traceback (most recent call last):
  File "/data/build/adhoc-cicd-odoo-odoo/odoo/tools/convert.py", line 537, in _tag_root
    f(rec)
  File "/data/build/adhoc-cicd-odoo-odoo/odoo/tools/convert.py", line 261, in _tag_function
    _eval_xml(self, rec, env)
  File "/data/build/adhoc-cicd-odoo-odoo/odoo/tools/convert.py", line 188, in _eval_xml
    return odoo.api.call_kw(model, method_name, args, kwargs)
  File "/data/build/adhoc-cicd-odoo-odoo/odoo/api.py", line 533, in call_kw
    result = getattr(recs, name)(*args, **kwargs)
  File "/data/build/adhoc-cicd-odoo-odoo/addons/l10n_ar/models/account_chart_template.py", line 60, in try_loading
    return super().try_loading(template_code, company, install_demo, force_create)
  File "/data/build/adhoc-cicd-odoo-odoo/addons/account/models/chart_template.py", line 160, in try_loading
    return self._load(template_code, company, install_demo, force_create)
  File "/data/build/adhoc-cicd-odoo-odoo/addons/l10n_ar/models/account_chart_template.py", line 39, in _load
    res = super()._load(template_code, company, install_demo,force_create)
TypeError: AccountChartTemplate._load() takes 4 positional arguments but 5 were given
The above exception was the direct cause of the following exception:
Traceback (most recent call last):
  File "/data/build/adhoc-cicd-odoo-odoo/odoo/modules/loading.py", line 90, in load_demo
    load_data(env(su=True), idref, mode, kind='demo', package=package)
  File "/data/build/adhoc-cicd-odoo-odoo/odoo/modules/loading.py", line 72, in load_data
    tools.convert_file(env, package.name, filename, idref, mode, noupdate, kind)
  File "/data/build/adhoc-cicd-odoo-odoo/odoo/tools/convert.py", line 608, in convert_file
    convert_xml_import(env, module, fp, idref, mode, noupdate)
  File "/data/build/adhoc-cicd-odoo-odoo/odoo/tools/convert.py", line 679, in convert_xml_import
    obj.parse(doc.getroot())
  File "/data/build/adhoc-cicd-odoo-odoo/odoo/tools/convert.py", line 594, in parse
    self._tag_root(de)
  File "/data/build/adhoc-cicd-odoo-odoo/odoo/tools/convert.py", line 550, in _tag_root
    raise ParseError('while parsing %s:%s, somewhere inside\n%s' % (
odoo.tools.convert.ParseError: while parsing /data/build/adhoc-cicd-odoo-odoo/addons/l10n_pe/demo/demo_company.xml:32, somewhere inside
<function model="account.chart.template" name="try_loading">
        <value eval="[]"/>
        <value>pe</value>
        <value model="res.company" eval="obj().env.ref('base.demo_company_pe')"/>
        <value name="install_demo" eval="True"/>
    </function>
2025-03-25 12:44:18 WARNING server odoo.modules.loading:94
Module l10n_uy demo data failed to install, installed without demo data
Traceback (most recent call last):
  File "/data/build/adhoc-cicd-odoo-odoo/odoo/tools/convert.py", line 537, in _tag_root
    f(rec)
  File "/data/build/adhoc-cicd-odoo-odoo/odoo/tools/convert.py", line 261, in _tag_function
    _eval_xml(self, rec, env)
  File "/data/build/adhoc-cicd-odoo-odoo/odoo/tools/convert.py", line 188, in _eval_xml
    return odoo.api.call_kw(model, method_name, args, kwargs)
  File "/data/build/adhoc-cicd-odoo-odoo/odoo/api.py", line 533, in call_kw
    result = getattr(recs, name)(*args, **kwargs)
  File "/data/build/adhoc-cicd-odoo-odoo/addons/l10n_ar/models/account_chart_template.py", line 60, in try_loading
    return super().try_loading(template_code, company, install_demo, force_create)
  File "/data/build/adhoc-cicd-odoo-odoo/addons/account/models/chart_template.py", line 160, in try_loading
    return self._load(template_code, company, install_demo, force_create)
  File "/data/build/adhoc-cicd-odoo-odoo/addons/l10n_uy/models/template_uy.py", line 60, in _load
    res = super()._load(template_code, company, install_demo, force_create)
  File "/data/build/adhoc-cicd-odoo-odoo/addons/l10n_ar/models/account_chart_template.py", line 39, in _load
    res = super()._load(template_code, company, install_demo,force_create)
TypeError: AccountChartTemplate._load() takes 4 positional arguments but 5 were given
The above exception was the direct cause of the following exception:
Traceback (most recent call last):
  File "/data/build/adhoc-cicd-odoo-odoo/odoo/modules/loading.py", line 90, in load_demo
    load_data(env(su=True), idref, mode, kind='demo', package=package)
  File "/data/build/adhoc-cicd-odoo-odoo/odoo/modules/loading.py", line 72, in load_data
    tools.convert_file(env, package.name, filename, idref, mode, noupdate, kind)
  File "/data/build/adhoc-cicd-odoo-odoo/odoo/tools/convert.py", line 608, in convert_file
    convert_xml_import(env, module, fp, idref, mode, noupdate)
  File "/data/build/adhoc-cicd-odoo-odoo/odoo/tools/convert.py", line 679, in convert_xml_import
    obj.parse(doc.getroot())
  File "/data/build/adhoc-cicd-odoo-odoo/odoo/tools/convert.py", line 594, in parse
    self._tag_root(de)
  File "/data/build/adhoc-cicd-odoo-odoo/odoo/tools/convert.py", line 550, in _tag_root
    raise ParseError('while parsing %s:%s, somewhere inside\n%s' % (
odoo.tools.convert.ParseError: while parsing /data/build/adhoc-cicd-odoo-odoo/addons/l10n_uy/demo/demo_company.xml:32, somewhere inside
<function model="account.chart.template" name="try_loading">
        <value eval="[]"/>
        <value>uy</value>
        <value model="res.company" eval="obj().env.ref('base.demo_company_uy')"/>
        <value name="install_demo" eval="True"/>
    </function>
2025-03-25 12:45:29 ERROR server odoo.addons.account_multicompany_ux.tests.test_account_multicompany_ux_unit_test:145
ERROR: TestAccountMulticompanyUxUnitTest.test_account_receivable
Traceback (most recent call last):
  File "/data/build/ingadhoc-multi-company/account_multicompany_ux/tests/test_account_multicompany_ux_unit_test.py", line 145, in test_account_receivable
    customer_invoice = self.env["account.move"].create(
  File "<decorator-gen-1287>", line 2, in create
  File "/data/build/adhoc-cicd-odoo-odoo/odoo/api.py", line 495, in _model_create_multi
    return create(self, [arg])
  File "/data/build/adhoc-cicd-odoo-odoo/addons/purchase/models/account_invoice.py", line 167, in create
    moves = super(AccountMove, self).create(vals_list)
  File "<decorator-gen-687>", line 2, in create
  File "/data/build/adhoc-cicd-odoo-odoo/odoo/api.py", line 496, in _model_create_multi
    return create(self, arg)
  File "/data/build/adhoc-cicd-odoo-odoo/addons/account/models/account_move.py", line 3185, in create
    moves = super().create(vals_list)
  File "<decorator-gen-147>", line 2, in create
  File "/data/build/adhoc-cicd-odoo-odoo/odoo/api.py", line 496, in _model_create_multi
    return create(self, arg)
  File "/data/build/adhoc-cicd-odoo-odoo/addons/mail/models/mail_thread.py", line 268, in create
    threads = super(MailThread, self).create(vals_list)
  File "<decorator-gen-31>", line 2, in create
  File "/data/build/adhoc-cicd-odoo-odoo/odoo/api.py", line 496, in _model_create_multi
    return create(self, arg)
  File "/data/build/adhoc-cicd-odoo-odoo/odoo/models.py", line 5026, in create
    records._check_company()
  File "/data/build/adhoc-cicd-odoo-odoo/odoo/models.py", line 4376, in _check_company
    raise UserError("\n".join(lines))
odoo.exceptions.UserError: Incompatible companies on records:
- “Draft Invoice” belongs to company “ES Company” and “Partner” (partner_id: 'ADHOC S.A., Cashbox demo') belongs to another company.
- “Draft Invoice” belongs to company “ES Company” and “Commercial Entity” (commercial_partner_id: 'ADHOC S.A., Cashbox demo') belongs to another company.
- “Draft Invoice” belongs to company “ES Company” and “Delivery Address” (partner_shipping_id: 'ADHOC S.A., Cashbox demo') belongs to another company.
2025-03-25 12:45:29 ERROR server odoo.addons.account_multicompany_ux.tests.test_account_multicompany_ux_unit_test:69
ERROR: TestAccountMulticompanyUxUnitTest.test_multicompany_sale_order
Traceback (most recent call last):
  File "/data/build/ingadhoc-multi-company/account_multicompany_ux/tests/test_account_multicompany_ux_unit_test.py", line 69, in test_multicompany_sale_order
    invoice = self.env["account.move"].create(
  File "<decorator-gen-1287>", line 2, in create
  File "/data/build/adhoc-cicd-odoo-odoo/odoo/api.py", line 495, in _model_create_multi
    return create(self, [arg])
  File "/data/build/adhoc-cicd-odoo-odoo/addons/purchase/models/account_invoice.py", line 167, in create
    moves = super(AccountMove, self).create(vals_list)
  File "<decorator-gen-687>", line 2, in create
  File "/data/build/adhoc-cicd-odoo-odoo/odoo/api.py", line 496, in _model_create_multi
    return create(self, arg)
  File "/data/build/adhoc-cicd-odoo-odoo/addons/account/models/account_move.py", line 3185, in create
    moves = super().create(vals_list)
  File "<decorator-gen-147>", line 2, in create
  File "/data/build/adhoc-cicd-odoo-odoo/odoo/api.py", line 496, in _model_create_multi
    return create(self, arg)
  File "/data/build/adhoc-cicd-odoo-odoo/addons/mail/models/mail_thread.py", line 268, in create
    threads = super(MailThread, self).create(vals_list)
  File "<decorator-gen-31>", line 2, in create
  File "/data/build/adhoc-cicd-odoo-odoo/odoo/api.py", line 496, in _model_create_multi
    return create(self, arg)
  File "/data/build/adhoc-cicd-odoo-odoo/odoo/models.py", line 5026, in create
    records._check_company()
  File "/data/build/adhoc-cicd-odoo-odoo/odoo/models.py", line 4376, in _check_company
    raise UserError("\n".join(lines))
odoo.exceptions.UserError: Incompatible companies on records:
- “Draft Invoice” belongs to company “ES Company” and “Partner” (partner_id: 'ADHOC S.A., Cashbox demo') belongs to another company.
- “Draft Invoice” belongs to company “ES Company” and “Commercial Entity” (commercial_partner_id: 'ADHOC S.A., Cashbox demo') belongs to another company.
- “Draft Invoice” belongs to company “ES Company” and “Delivery Address” (partner_shipping_id: 'ADHOC S.A., Cashbox demo') belongs to another company.
2025-03-25 12:45:29 ERROR server odoo.modules.loading:321 Module account_multicompany_ux: 0 failures, 2 errors of 2 tests
2025-03-25 12:47:36 WARNING server odoo.modules.loading:94
Module l10n_ar_tax demo data failed to install, installed without demo data
Traceback (most recent call last):
  File "/data/build/adhoc-cicd-odoo-odoo/odoo/tools/cache.py", line 103, in lookup
    r = d[key]
  File "<decorator-gen-6>", line 2, in __getitem__
  File "/data/build/adhoc-cicd-odoo-odoo/odoo/tools/func.py", line 97, in locked
    return func(inst, *args, **kwargs)
  File "/data/build/adhoc-cicd-odoo-odoo/odoo/tools/lru.py", line 33, in __getitem__
    a = self.d[obj]
KeyError: ('ir.model.data', <function IrModelData._xmlid_lookup at 0x7f7e655c1bd0>, 'base.company_ri')
During handling of the above exception, another exception occurred:
Traceback (most recent call last):
  File "/data/build/adhoc-cicd-odoo-odoo/odoo/tools/convert.py", line 537, in _tag_root
    f(rec)
  File "/data/build/adhoc-cicd-odoo-odoo/odoo/tools/convert.py", line 400, in _tag_record
    f_val = self.id_get(f_ref, raise_if_not_found=nodeattr2bool(rec, 'forcecreate', True))
  File "/data/build/adhoc-cicd-odoo-odoo/odoo/tools/convert.py", line 519, in id_get
    res = self.model_id_get(id_str, raise_if_not_found)
  File "/data/build/adhoc-cicd-odoo-odoo/odoo/tools/convert.py", line 525, in model_id_get
    return self.env['ir.model.data']._xmlid_to_res_model_res_id(id_str, raise_if_not_found=raise_if_not_found)
  File "/data/build/adhoc-cicd-odoo-odoo/odoo/addons/base/models/ir_model.py", line 2246, in _xmlid_to_res_model_res_id
    return self._xmlid_lookup(xmlid)
  File "<decorator-gen-44>", line 2, in _xmlid_lookup
  File "/data/build/adhoc-cicd-odoo-odoo/odoo/tools/cache.py", line 110, in lookup
    value = d[key] = self.method(*args, **kwargs)
  File "/data/build/adhoc-cicd-odoo-odoo/odoo/addons/base/models/ir_model.py", line 2239, in _xmlid_lookup
    raise ValueError('External ID not found in the system: %s' % xmlid)
ValueError: External ID not found in the system: base.company_ri
The above exception was the direct cause of the following exception:
Traceback (most recent call last):
  File "/data/build/adhoc-cicd-odoo-odoo/odoo/modules/loading.py", line 90, in load_demo
    load_data(env(su=True), idref, mode, kind='demo', package=package)
  File "/data/build/adhoc-cicd-odoo-odoo/odoo/modules/loading.py", line 72, in load_data
    tools.convert_file(env, package.name, filename, idref, mode, noupdate, kind)
  File "/data/build/adhoc-cicd-odoo-odoo/odoo/tools/convert.py", line 608, in convert_file
    convert_xml_import(env, module, fp, idref, mode, noupdate)
  File "/data/build/adhoc-cicd-odoo-odoo/odoo/tools/convert.py", line 679, in convert_xml_import
    obj.parse(doc.getroot())
  File "/data/build/adhoc-cicd-odoo-odoo/odoo/tools/convert.py", line 594, in parse
    self._tag_root(de)
  File "/data/build/adhoc-cicd-odoo-odoo/odoo/tools/convert.py", line 550, in _tag_root
    raise ParseError('while parsing %s:%s, somewhere inside\n%s' % (
odoo.tools.convert.ParseError: while parsing /data/build/ingadhoc-odoo-argentina/l10n_ar_tax/demo/account_fiscal_position_demo.xml:5, somewhere inside
<record id="fiscal_position_caba_and_proffits" model="account.fiscal.position">
        <field name="name">IIBB CABA + ganancias</field>
        <field name="l10n_ar_afip_responsibility_type_ids" eval="[(6, 0, [ref('l10n_ar.res_IVARI')])]"/>
        <field name="auto_apply" eval="True"/>
        <field name="country_id" ref="base.ar"/>
        <field name="company_id" ref="base.company_ri"/>
        <field name="state_ids" eval="[(6, 0, [ref('base.state_ar_c')])]"/>
    </record>
2025-03-25 12:47:36 WARNING server odoo.modules.loading:94
Module l10n_ar_website_sale demo data failed to install, installed without demo data
Traceback (most recent call last):
  File "/data/build/adhoc-cicd-odoo-odoo/odoo/tools/cache.py", line 103, in lookup
    r = d[key]
  File "<decorator-gen-6>", line 2, in __getitem__
  File "/data/build/adhoc-cicd-odoo-odoo/odoo/tools/func.py", line 97, in locked
    return func(inst, *args, **kwargs)
  File "/data/build/adhoc-cicd-odoo-odoo/odoo/tools/lru.py", line 33, in __getitem__
    a = self.d[obj]
KeyError: ('ir.model.data', <function IrModelData._xmlid_lookup at 0x7f7e655c1bd0>, 'base.company_ri')
During handling of the above exception, another exception occurred:
Traceback (most recent call last):
  File "/data/build/adhoc-cicd-odoo-odoo/odoo/tools/convert.py", line 537, in _tag_root
    f(rec)
  File "/data/build/adhoc-cicd-odoo-odoo/odoo/tools/convert.py", line 400, in _tag_record
    f_val = self.id_get(f_ref, raise_if_not_found=nodeattr2bool(rec, 'forcecreate', True))
  File "/data/build/adhoc-cicd-odoo-odoo/odoo/tools/convert.py", line 519, in id_get
    res = self.model_id_get(id_str, raise_if_not_found)
  File "/data/build/adhoc-cicd-odoo-odoo/odoo/tools/convert.py", line 525, in model_id_get
    return self.env['ir.model.data']._xmlid_to_res_model_res_id(id_str, raise_if_not_found=raise_if_not_found)
  File "/data/build/adhoc-cicd-odoo-odoo/odoo/addons/base/models/ir_model.py", line 2246, in _xmlid_to_res_model_res_id
    return self._xmlid_lookup(xmlid)
  File "<decorator-gen-44>", line 2, in _xmlid_lookup
  File "/data/build/adhoc-cicd-odoo-odoo/odoo/tools/cache.py", line 110, in lookup
    value = d[key] = self.method(*args, **kwargs)
  File "/data/build/adhoc-cicd-odoo-odoo/odoo/addons/base/models/ir_model.py", line 2239, in _xmlid_lookup
    raise ValueError('External ID not found in the system: %s' % xmlid)
ValueError: External ID not found in the system: base.company_ri
The above exception was the direct cause of the following exception:
Traceback (most recent call last):
  File "/data/build/adhoc-cicd-odoo-odoo/odoo/modules/loading.py", line 90, in load_demo
    load_data(env(su=True), idref, mode, kind='demo', package=package)
  File "/data/build/adhoc-cicd-odoo-odoo/odoo/modules/loading.py", line 72, in load_data
    tools.convert_file(env, package.name, filename, idref, mode, noupdate, kind)
  File "/data/build/adhoc-cicd-odoo-odoo/odoo/tools/convert.py", line 608, in convert_file
    convert_xml_import(env, module, fp, idref, mode, noupdate)
  File "/data/build/adhoc-cicd-odoo-odoo/odoo/tools/convert.py", line 679, in convert_xml_import
    obj.parse(doc.getroot())
  File "/data/build/adhoc-cicd-odoo-odoo/odoo/tools/convert.py", line 594, in parse
    self._tag_root(de)
  File "/data/build/adhoc-cicd-odoo-odoo/odoo/tools/convert.py", line 550, in _tag_root
    raise ParseError('while parsing %s:%s, somewhere inside\n%s' % (
odoo.tools.convert.ParseError: while parsing /data/build/adhoc-cicd-odoo-odoo/addons/l10n_ar_website_sale/demo/website_demo.xml:4, somewhere inside
<record id="default_website_ri" model="website">
        <field name="name">(AR) Responsable Inscripto Website</field>
        <field name="company_id" ref="base.company_ri"/>
        <field name="domain" model="ir.config_parameter" eval="obj().env['ir.config_parameter'].sudo().get_param('web.base.url')"/>
    </record>
2025-03-25 12:50:02 WARNING server odoo.modules.loading:94
Module demo_wholesale demo data failed to install, installed without demo data
Traceback (most recent call last):
  File "/data/build/adhoc-cicd-odoo-odoo/odoo/tools/cache.py", line 103, in lookup
    r = d[key]
  File "<decorator-gen-6>", line 2, in __getitem__
  File "/data/build/adhoc-cicd-odoo-odoo/odoo/tools/func.py", line 97, in locked
    return func(inst, *args, **kwargs)
  File "/data/build/adhoc-cicd-odoo-odoo/odoo/tools/lru.py", line 33, in __getitem__
    a = self.d[obj]
KeyError: ('ir.model.data', <function IrModelData._xmlid_lookup at 0x7f7e655c1bd0>, 'base.demo_company_cl')
During handling of the above exception, another exception occurred:
Traceback (most recent call last):
  File "/data/build/adhoc-cicd-odoo-odoo/odoo/tools/convert.py", line 537, in _tag_root
    f(rec)
  File "/data/build/adhoc-cicd-odoo-odoo/odoo/tools/convert.py", line 261, in _tag_function
    _eval_xml(self, rec, env)
  File "/data/build/adhoc-cicd-odoo-odoo/odoo/tools/convert.py", line 188, in _eval_xml
    return odoo.api.call_kw(model, method_name, args, kwargs)
  File "/data/build/adhoc-cicd-odoo-odoo/odoo/api.py", line 533, in call_kw
    result = getattr(recs, name)(*args, **kwargs)
  File "/data/build/ingadhoc-ingadhoc-demo/demo_wholesale/demo_py/website.py", line 18, in _init_demo_wholesale
    self._load_websites(parameters)
  File "/data/build/ingadhoc-ingadhoc-demo/demo_base/demo_py/website.py", line 19, in _load_websites
    cl_c = self.env.ref("base.demo_company_cl")
  File "/data/build/adhoc-cicd-odoo-odoo/odoo/api.py", line 658, in ref
    res_model, res_id = self['ir.model.data']._xmlid_to_res_model_res_id(
  File "/data/build/adhoc-cicd-odoo-odoo/odoo/addons/base/models/ir_model.py", line 2246, in _xmlid_to_res_model_res_id
    return self._xmlid_lookup(xmlid)
  File "<decorator-gen-44>", line 2, in _xmlid_lookup
  File "/data/build/adhoc-cicd-odoo-odoo/odoo/tools/cache.py", line 110, in lookup
    value = d[key] = self.method(*args, **kwargs)
  File "/data/build/adhoc-cicd-odoo-odoo/odoo/addons/base/models/ir_model.py", line 2239, in _xmlid_lookup
    raise ValueError('External ID not found in the system: %s' % xmlid)
ValueError: External ID not found in the system: base.demo_company_cl
The above exception was the direct cause of the following exception:
Traceback (most recent call last):
  File "/data/build/adhoc-cicd-odoo-odoo/odoo/modules/loading.py", line 90, in load_demo
    load_data(env(su=True), idref, mode, kind='demo', package=package)
  File "/data/build/adhoc-cicd-odoo-odoo/odoo/modules/loading.py", line 72, in load_data
    tools.convert_file(env, package.name, filename, idref, mode, noupdate, kind)
  File "/data/build/adhoc-cicd-odoo-odoo/odoo/tools/convert.py", line 608, in convert_file
    convert_xml_import(env, module, fp, idref, mode, noupdate)
  File "/data/build/adhoc-cicd-odoo-odoo/odoo/tools/convert.py", line 679, in convert_xml_import
    obj.parse(doc.getroot())
  File "/data/build/adhoc-cicd-odoo-odoo/odoo/tools/convert.py", line 594, in parse
    self._tag_root(de)
  File "/data/build/adhoc-cicd-odoo-odoo/odoo/tools/convert.py", line 550, in _tag_root
    raise ParseError('while parsing %s:%s, somewhere inside\n%s' % (
odoo.tools.convert.ParseError: while parsing /data/build/ingadhoc-ingadhoc-demo/demo_wholesale/demo/init_demo_py.xml:3, somewhere inside
<function model="website" name="_init_demo_wholesale"/>
2025-03-25 12:50:07 ERROR server odoo.addons.demo_full.tests.test_account_payment_pro:35
ERROR: TestAccountPaymentPro.test_account_ux_payment_pro
Traceback (most recent call last):
  File "/data/build/ingadhoc-ingadhoc-demo/demo_full/tests/test_account_payment_pro.py", line 35, in setUp
    self.rates = self.env["res.currency.rate"].create(
  File "<decorator-gen-100>", line 2, in create
  File "/data/build/adhoc-cicd-odoo-odoo/odoo/api.py", line 496, in _model_create_multi
    return create(self, arg)
  File "/data/build/adhoc-cicd-odoo-odoo/odoo/addons/base/models/res_currency.py", line 387, in create
    return super().create([self._sanitize_vals(vals) for vals in vals_list])
  File "<decorator-gen-31>", line 2, in create
  File "/data/build/adhoc-cicd-odoo-odoo/odoo/api.py", line 496, in _model_create_multi
    return create(self, arg)
  File "/data/build/adhoc-cicd-odoo-odoo/odoo/models.py", line 4988, in create
    records = self._create(data_list)
  File "/data/build/adhoc-cicd-odoo-odoo/odoo/models.py", line 5246, in _create
    records._validate_fields(name for data in data_list for name in data['stored'])
  File "/data/build/adhoc-cicd-odoo-odoo/odoo/models.py", line 1599, in _validate_fields
    check(self)
  File "/data/build/ingadhoc-account-financial-tools/account_ux/models/res_currency_rate.py", line 21, in _check_date_rate
    raise ValidationError(
odoo.exceptions.ValidationError: You can not create a rate without company since you already have rates before 2024-01-01 with company set. The rate you want to create will not have any effect, will not be take into account.
2025-03-25 12:50:07 ERROR server odoo.addons.demo_full.tests.test_account_payment_pro:35
ERROR: TestAccountPaymentPro.test_account_ux_payment_pro_multicompany_1
Traceback (most recent call last):
  File "/data/build/ingadhoc-ingadhoc-demo/demo_full/tests/test_account_payment_pro.py", line 35, in setUp
    self.rates = self.env["res.currency.rate"].create(
  File "<decorator-gen-100>", line 2, in create
  File "/data/build/adhoc-cicd-odoo-odoo/odoo/api.py", line 496, in _model_create_multi
    return create(self, arg)
  File "/data/build/adhoc-cicd-odoo-odoo/odoo/addons/base/models/res_currency.py", line 387, in create
    return super().create([self._sanitize_vals(vals) for vals in vals_list])
  File "<decorator-gen-31>", line 2, in create
  File "/data/build/adhoc-cicd-odoo-odoo/odoo/api.py", line 496, in _model_create_multi
    return create(self, arg)
  File "/data/build/adhoc-cicd-odoo-odoo/odoo/models.py", line 4988, in create
    records = self._create(data_list)
  File "/data/build/adhoc-cicd-odoo-odoo/odoo/models.py", line 5246, in _create
    records._validate_fields(name for data in data_list for name in data['stored'])
  File "/data/build/adhoc-cicd-odoo-odoo/odoo/models.py", line 1599, in _validate_fields
    check(self)
  File "/data/build/ingadhoc-account-financial-tools/account_ux/models/res_currency_rate.py", line 21, in _check_date_rate
    raise ValidationError(
odoo.exceptions.ValidationError: You can not create a rate without company since you already have rates before 2024-01-01 with company set. The rate you want to create will not have any effect, will not be take into account.
2025-03-25 12:50:07 ERROR server odoo.addons.demo_full.tests.test_account_payment_pro:35
ERROR: TestAccountPaymentPro.test_account_ux_payment_pro_multicompany_2
Traceback (most recent call last):
  File "/data/build/ingadhoc-ingadhoc-demo/demo_full/tests/test_account_payment_pro.py", line 35, in setUp
    self.rates = self.env["res.currency.rate"].create(
  File "<decorator-gen-100>", line 2, in create
  File "/data/build/adhoc-cicd-odoo-odoo/odoo/api.py", line 496, in _model_create_multi
    return create(self, arg)
  File "/data/build/adhoc-cicd-odoo-odoo/odoo/addons/base/models/res_currency.py", line 387, in create
    return super().create([self._sanitize_vals(vals) for vals in vals_list])
  File "<decorator-gen-31>", line 2, in create
  File "/data/build/adhoc-cicd-odoo-odoo/odoo/api.py", line 496, in _model_create_multi
    return create(self, arg)
  File "/data/build/adhoc-cicd-odoo-odoo/odoo/models.py", line 4988, in create
    records = self._create(data_list)
  File "/data/build/adhoc-cicd-odoo-odoo/odoo/models.py", line 5246, in _create
    records._validate_fields(name for data in data_list for name in data['stored'])
  File "/data/build/adhoc-cicd-odoo-odoo/odoo/models.py", line 1599, in _validate_fields
    check(self)
  File "/data/build/ingadhoc-account-financial-tools/account_ux/models/res_currency_rate.py", line 21, in _check_date_rate
    raise ValidationError(
odoo.exceptions.ValidationError: You can not create a rate without company since you already have rates before 2024-01-01 with company set. The rate you want to create will not have any effect, will not be take into account.
2025-03-25 12:50:07 ERROR server odoo.addons.demo_full.tests.test_account_payment_pro_sale_type:27
ERROR: TestAccountPaymentProSaleType.test_account_payment_pro_sale_type
Traceback (most recent call last):
  File "/data/build/ingadhoc-ingadhoc-demo/demo_full/tests/test_account_payment_pro_sale_type.py", line 27, in setUp
    self.sale_order_type = self.env["sale.order.type"].create(
  File "<decorator-gen-31>", line 2, in create
  File "/data/build/adhoc-cicd-odoo-odoo/odoo/api.py", line 495, in _model_create_multi
    return create(self, [arg])
  File "/data/build/adhoc-cicd-odoo-odoo/odoo/models.py", line 4988, in create
    records = self._create(data_list)
  File "/data/build/adhoc-cicd-odoo-odoo/odoo/models.py", line 5246, in _create
    records._validate_fields(name for data in data_list for name in data['stored'])
  File "/data/build/adhoc-cicd-odoo-odoo/odoo/models.py", line 1599, in _validate_fields
    check(self)
  File "/data/build/ingadhoc-sale/sale_order_type_automation/models/sale_order_type.py", line 112, in validate_invoicing_atomation
    raise ValidationError(_("If you choose a Payment automation, Payment Journal " "is required"))
odoo.exceptions.ValidationError: If you choose a Payment automation, Payment Journal is required
2025-03-25 12:50:13 ERROR server odoo.sql_db:357
bad query: b'INSERT INTO "account_move" ("auto_post", "company_id", "create_date", "create_uid", "currency_id", "date", "delivery_date", "extract_state", "fiscal_position_id", "invoice_currency_rate", "invoice_incoterm_id", "invoice_payment_term_id", "journal_id", "l10n_es_edi_facturae_reason_code", "l10n_es_payment_means", "l10n_es_reports_mod349_invoice_type", "move_type", "partner_id", "partner_shipping_id", "sale_type_id", "state", "write_date", "write_uid") VALUES (\'no\', NULL, \'2025-03-25 12:50:08.874047\', 1, NULL, \'2025-03-25\', NULL, \'no_extract_requested\', NULL, 1.0, NULL, 11, NULL, \'10\', \'04\', NULL, \'out_invoice\', 50, 50, NULL, \'draft\', \'2025-03-25 12:50:08.874047\', 1) RETURNING "id"'
ERROR: null value in column "journal_id" violates not-null constraint
DETAIL:  Failing row contains (63, null, null, null, null, null, null, null, null, null, null, 11, 50, null, 50, null, null, null, null, null, null, null, null, 1, 1, null, null, null, null, draft, out_invoice, no, null, null, null, null, null, null, null, null, 2025-03-25, null, null, null, null, null, null, 1.0, null, null, null, null, null, null, null, null, null, null, null, null, null, null, null, null, null, null, 2025-03-25 12:50:08.874047, 2025-03-25 12:50:08.874047, null, null, null, null, null, null, null, null, null, null, null, null, null, null, null, null, null, null, null, null, null, null, null, null, null, null, null, 10, 04, null, null, null, null, null, null, null, null, null, null, no_extract_requested, null, null, null, null, null, null, null, null, null, null, null, null, null, null, null, null, null, null, null, null, null, null, null, null, null, null, null, null, null, null, null, null, null, null, null, null, null, null, null, null, null, null, null, null, null, null, null, null, null, null, null, null, null, null, null).
2025-03-25 12:50:13 ERROR server odoo.addons.demo_full.tests.test_multicompany:98
ERROR: TestMulticompany02.test_multicompany_payment_term
Traceback (most recent call last):
  File "/data/build/ingadhoc-ingadhoc-demo/demo_full/tests/test_multicompany.py", line 98, in test_multicompany_payment_term
    invoice = self.env["account.move"].create(
  File "<decorator-gen-1472>", line 2, in create
  File "/data/build/adhoc-cicd-odoo-odoo/odoo/api.py", line 495, in _model_create_multi
    return create(self, [arg])
  File "/data/build/adhoc-cicd-odoo-enterprise/l10n_es_reports/models/account_move.py", line 145, in create
    moves = super().create(vals_list)
  File "<decorator-gen-1287>", line 2, in create
  File "/data/build/adhoc-cicd-odoo-odoo/odoo/api.py", line 496, in _model_create_multi
    return create(self, arg)
  File "/data/build/adhoc-cicd-odoo-odoo/addons/purchase/models/account_invoice.py", line 167, in create
    moves = super(AccountMove, self).create(vals_list)
  File "<decorator-gen-687>", line 2, in create
  File "/data/build/adhoc-cicd-odoo-odoo/odoo/api.py", line 496, in _model_create_multi
    return create(self, arg)
  File "/data/build/adhoc-cicd-odoo-odoo/addons/account/models/account_move.py", line 3185, in create
    moves = super().create(vals_list)
  File "<decorator-gen-147>", line 2, in create
  File "/data/build/adhoc-cicd-odoo-odoo/odoo/api.py", line 496, in _model_create_multi
    return create(self, arg)
  File "/data/build/adhoc-cicd-odoo-odoo/addons/mail/models/mail_thread.py", line 268, in create
    threads = super(MailThread, self).create(vals_list)
  File "<decorator-gen-31>", line 2, in create
  File "/data/build/adhoc-cicd-odoo-odoo/odoo/api.py", line 496, in _model_create_multi
    return create(self, arg)
  File "/data/build/adhoc-cicd-odoo-odoo/odoo/models.py", line 4988, in create
    records = self._create(data_list)
  File "/data/build/adhoc-cicd-odoo-odoo/odoo/models.py", line 5172, in _create
    cr.execute(SQL(
  File "/data/build/adhoc-cicd-odoo-odoo/odoo/sql_db.py", line 354, in execute
    res = self._obj.execute(query, params)
psycopg2.errors.NotNullViolation: null value in column "journal_id" violates not-null constraint
DETAIL:  Failing row contains (63, null, null, null, null, null, null, null, null, null, null, 11, 50, null, 50, null, null, null, null, null, null, null, null, 1, 1, null, null, null, null, draft, out_invoice, no, null, null, null, null, null, null, null, null, 2025-03-25, null, null, null, null, null, null, 1.0, null, null, null, null, null, null, null, null, null, null, null, null, null, null, null, null, null, null, 2025-03-25 12:50:08.874047, 2025-03-25 12:50:08.874047, null, null, null, null, null, null, null, null, null, null, null, null, null, null, null, null, null, null, null, null, null, null, null, null, null, null, null, 10, 04, null, null, null, null, null, null, null, null, null, null, no_extract_requested, null, null, null, null, null, null, null, null, null, null, null, null, null, null, null, null, null, null, null, null, null, null, null, null, null, null, null, null, null, null, null, null, null, null, null, null, null, null, null, null, null, null, null, null, null, null, null, null, null, null, null, null, null, null, null).
2025-03-25 12:50:13 ERROR server odoo.sql_db:357
bad query: b'INSERT INTO "sale_order" ("company_id", "create_date", "create_uid", "currency_id", "currency_rate", "date_order", "delivery_status", "fiscal_position_id", "health", "is_batch", "is_invoice_cron", "is_rental_order", "journal_id", "locked", "name", "note", "partner_id", "partner_invoice_id", "partner_shipping_id", "payment_term_id", "percentage_satisfaction", "picking_policy", "prepayment_percent", "pricelist_id", "require_payment", "require_signature", "sale_order_template_id", "state", "team_id", "type_id", "user_id", "validity_date", "validity_days", "warehouse_id", "write_date", "write_uid") VALUES (NULL, \'2025-03-25 12:50:08.874047\', 1, NULL, 1.0, \'2025-03-25 12:50:09\', \'no\', NULL, \'normal\', false, false, false, NULL, false, \'S00076\', NULL, 50, 51, 50, NULL,  -1, \'direct\', 0.0, NULL, false, false, NULL, \'draft\', 1, 11, 1, NULL, 0, NULL, \'2025-03-25 12:50:08.874047\', 1) RETURNING "id"'
ERROR: null value in column "company_id" violates not-null constraint
DETAIL:  Failing row contains (77, null, null, null, null, 50, null, 51, 50, null, null, null, null, 1, 1, 1, 1, null, S00076, draft, null, null, null, null, null, null, null, 1.0, null, null, null, f, f, f, 2025-03-25 12:50:08.874047, null, 2025-03-25 12:50:09, null, 2025-03-25 12:50:08.874047, 0, null, null, null, null, null, null, null, null, null, null, 0, null, null, null, null, f, null, null, null, null, direct, no, null, null, null, null, null, null, null, null, null, null, null, null, null, null, null, null, null, null, null, -1, normal, null, null, null, null, null, null, null, null, null, null, f, f, null, null, null, null, null, null, null, null, null, null, null, null, null, null, 11, null, null).
2025-03-25 12:50:13 ERROR server odoo.addons.demo_full.tests.test_multicompany:59
ERROR: TestMulticompany02.test_multicompany_sale_order
Traceback (most recent call last):
  File "/data/build/ingadhoc-ingadhoc-demo/demo_full/tests/test_multicompany.py", line 59, in test_multicompany_sale_order
    sale_order = self.sale_order_model.create(vals)
  File "<decorator-gen-1531>", line 2, in create
  File "/data/build/adhoc-cicd-odoo-odoo/odoo/api.py", line 495, in _model_create_multi
    return create(self, [arg])
  File "/data/build/adhoc-cicd-odoo-enterprise/industry_fsm_sale/models/sale_order.py", line 15, in create
    orders = super().create(vals)
  File "<decorator-gen-1529>", line 2, in create
  File "/data/build/adhoc-cicd-odoo-odoo/odoo/api.py", line 496, in _model_create_multi
    return create(self, arg)
  File "/data/build/ingadhoc-sale/sale_order_type_ux/models/sale_order.py", line 24, in create
    res = super().create(vals)
  File "<decorator-gen-1526>", line 2, in create
  File "/data/build/adhoc-cicd-odoo-odoo/odoo/api.py", line 496, in _model_create_multi
    return create(self, arg)
  File "/data/build/adhoc-cicd-oca-sale-workflow/sale_order_type/models/sale.py", line 157, in create
    return super().create(vals_list)
  File "<decorator-gen-1519>", line 2, in create
  File "/data/build/adhoc-cicd-odoo-odoo/odoo/api.py", line 496, in _model_create_multi
    return create(self, arg)
  File "/data/build/ingadhoc-sale/sale_stock_ux/models/sale_order.py", line 65, in create
    return super().create(vals_list)
  File "<decorator-gen-1518>", line 2, in create
  File "/data/build/adhoc-cicd-odoo-odoo/odoo/api.py", line 496, in _model_create_multi
    return create(self, arg)
  File "/data/build/adhoc-cicd-odoo-odoo/addons/sale_project/models/sale_order.py", line 273, in create
    created_records = super().create(vals_list)
  File "<decorator-gen-1508>", line 2, in create
  File "/data/build/adhoc-cicd-odoo-odoo/odoo/api.py", line 496, in _model_create_multi
    return create(self, arg)
  File "/data/build/adhoc-cicd-odoo-odoo/addons/website_sale/models/sale_order.py", line 164, in create
    return super().create(vals_list)
  File "<decorator-gen-1493>", line 2, in create
  File "/data/build/adhoc-cicd-odoo-odoo/odoo/api.py", line 496, in _model_create_multi
    return create(self, arg)
  File "/data/build/adhoc-cicd-odoo-enterprise/sale_subscription/models/sale_order.py", line 575, in create
    orders = super().create(vals_list)
  File "<decorator-gen-1351>", line 2, in create
  File "/data/build/adhoc-cicd-odoo-odoo/odoo/api.py", line 496, in _model_create_multi
    return create(self, arg)
  File "/data/build/adhoc-cicd-odoo-odoo/addons/sale/models/sale_order.py", line 977, in create
    return super().create(vals_list)
  File "<decorator-gen-147>", line 2, in create
  File "/data/build/adhoc-cicd-odoo-odoo/odoo/api.py", line 496, in _model_create_multi
    return create(self, arg)
  File "/data/build/adhoc-cicd-odoo-odoo/addons/mail/models/mail_thread.py", line 268, in create
    threads = super(MailThread, self).create(vals_list)
  File "<decorator-gen-31>", line 2, in create
  File "/data/build/adhoc-cicd-odoo-odoo/odoo/api.py", line 496, in _model_create_multi
    return create(self, arg)
  File "/data/build/adhoc-cicd-odoo-odoo/odoo/models.py", line 4988, in create
    records = self._create(data_list)
  File "/data/build/adhoc-cicd-odoo-odoo/odoo/models.py", line 5172, in _create
    cr.execute(SQL(
  File "/data/build/adhoc-cicd-odoo-odoo/odoo/sql_db.py", line 354, in execute
    res = self._obj.execute(query, params)
psycopg2.errors.NotNullViolation: null value in column "company_id" violates not-null constraint
DETAIL:  Failing row contains (77, null, null, null, null, 50, null, 51, 50, null, null, null, null, 1, 1, 1, 1, null, S00076, draft, null, null, null, null, null, null, null, 1.0, null, null, null, f, f, f, 2025-03-25 12:50:08.874047, null, 2025-03-25 12:50:09, null, 2025-03-25 12:50:08.874047, 0, null, null, null, null, null, null, null, null, null, null, 0, null, null, null, null, f, null, null, null, null, direct, no, null, null, null, null, null, null, null, null, null, null, null, null, null, null, null, null, null, null, null, -1, normal, null, null, null, null, null, null, null, null, null, null, f, f, null, null, null, null, null, null, null, null, null, null, null, null, null, null, 11, null, null).
2025-03-25 12:50:13 ERROR server odoo.modules.loading:321 Module demo_full: 0 failures, 6 errors of 8 tests
2025-03-25 12:50:13 INFO server odoo.modules.loading:357 640 modules loaded in 697.89s, 377793 queries (+400014 extra)
2025-03-25 12:50:13 INFO server odoo.modules.loading:357 641 modules loaded in 1.06s, 340 queries (+340 extra)
2025-03-25 12:50:19 ERROR server odoo.modules.loading:601 At least one test failed when loading the modules.
2025-03-25 12:50:19 INFO server odoo.addons.base.models.ir_qweb:357 Pregenerating assets bundles
2025-03-25 12:52:23 ERROR server odoo.tests.suite:131
ERROR: setUpClass (odoo.addons.account_debit_note.tests.test_out_debit_note.TestAccountDebitNote)
Traceback (most recent call last):
  File "/data/build/adhoc-cicd-odoo-odoo/addons/account/tests/common.py", line 52, in setUpClass
    super().setUpClass()
  File "/data/build/adhoc-cicd-odoo-odoo/addons/product/tests/common.py", line 16, in setUpClass
    super().setUpClass()
  File "/data/build/adhoc-cicd-odoo-odoo/odoo/addons/base/tests/common.py", line 36, in setUpClass
    independent_company = cls.setup_independent_company()
  File "/data/build/adhoc-cicd-odoo-odoo/addons/account/tests/common.py", line 200, in setup_independent_company
    return cls._create_company(name='company_1_data', **kwargs)
  File "/data/build/adhoc-cicd-odoo-odoo/addons/account/tests/common.py", line 225, in _create_company
    cls._use_chart_template(company, cls.chart_template)
  File "/data/build/adhoc-cicd-odoo-odoo/addons/account/tests/common.py", line 263, in _use_chart_template
    cls.env['account.chart.template'].try_loading(chart_template_ref, company=company, install_demo=False)
  File "/data/build/adhoc-cicd-odoo-odoo/addons/l10n_ar/models/account_chart_template.py", line 60, in try_loading
    return super().try_loading(template_code, company, install_demo, force_create)
  File "/data/build/adhoc-cicd-odoo-odoo/addons/account/models/chart_template.py", line 160, in try_loading
    return self._load(template_code, company, install_demo, force_create)
TypeError: AccountChartTemplate._load() takes 4 positional arguments but 5 were given
2025-03-25 12:53:24 ERROR server odoo.tests.suite:131
ERROR: setUpClass (odoo.addons.account_auto_transfer.tests.test_transfer_model.TransferModelTestFunctionalCase)
Traceback (most recent call last):
  File "/data/build/adhoc-cicd-odoo-enterprise/account_auto_transfer/tests/test_transfer_model.py", line 23, in setUpClass
    super().setUpClass()
  File "/data/build/adhoc-cicd-odoo-enterprise/account_auto_transfer/tests/account_auto_transfer_test_classes.py", line 13, in setUpClass
    super().setUpClass()
  File "/data/build/adhoc-cicd-odoo-odoo/addons/account/tests/common.py", line 52, in setUpClass
    super().setUpClass()
  File "/data/build/adhoc-cicd-odoo-odoo/addons/product/tests/common.py", line 16, in setUpClass
    super().setUpClass()
  File "/data/build/adhoc-cicd-odoo-odoo/odoo/addons/base/tests/common.py", line 36, in setUpClass
    independent_company = cls.setup_independent_company()
  File "/data/build/adhoc-cicd-odoo-odoo/addons/account/tests/common.py", line 200, in setup_independent_company
    return cls._create_company(name='company_1_data', **kwargs)
  File "/data/build/adhoc-cicd-odoo-odoo/addons/account/tests/common.py", line 225, in _create_company
    cls._use_chart_template(company, cls.chart_template)
  File "/data/build/adhoc-cicd-odoo-odoo/addons/account/tests/common.py", line 263, in _use_chart_template
    cls.env['account.chart.template'].try_loading(chart_template_ref, company=company, install_demo=False)
  File "/data/build/adhoc-cicd-odoo-odoo/addons/l10n_ar/models/account_chart_template.py", line 60, in try_loading
    return super().try_loading(template_code, company, install_demo, force_create)
  File "/data/build/adhoc-cicd-odoo-odoo/addons/account/models/chart_template.py", line 160, in try_loading
    return self._load(template_code, company, install_demo, force_create)
TypeError: AccountChartTemplate._load() takes 4 positional arguments but 5 were given
2025-03-25 12:53:24 ERROR server odoo.tests.suite:131
ERROR: setUpClass (odoo.addons.account_auto_transfer.tests.test_transfer_model.TransferModelTestCase)
Traceback (most recent call last):
  File "/data/build/adhoc-cicd-odoo-enterprise/account_auto_transfer/tests/account_auto_transfer_test_classes.py", line 13, in setUpClass
    super().setUpClass()
  File "/data/build/adhoc-cicd-odoo-odoo/addons/account/tests/common.py", line 52, in setUpClass
    super().setUpClass()
  File "/data/build/adhoc-cicd-odoo-odoo/addons/product/tests/common.py", line 16, in setUpClass
    super().setUpClass()
  File "/data/build/adhoc-cicd-odoo-odoo/odoo/addons/base/tests/common.py", line 36, in setUpClass
    independent_company = cls.setup_independent_company()
  File "/data/build/adhoc-cicd-odoo-odoo/addons/account/tests/common.py", line 200, in setup_independent_company
    return cls._create_company(name='company_1_data', **kwargs)
  File "/data/build/adhoc-cicd-odoo-odoo/addons/account/tests/common.py", line 225, in _create_company
    cls._use_chart_template(company, cls.chart_template)
  File "/data/build/adhoc-cicd-odoo-odoo/addons/account/tests/common.py", line 263, in _use_chart_template
    cls.env['account.chart.template'].try_loading(chart_template_ref, company=company, install_demo=False)
  File "/data/build/adhoc-cicd-odoo-odoo/addons/l10n_ar/models/account_chart_template.py", line 60, in try_loading
    return super().try_loading(template_code, company, install_demo, force_create)
  File "/data/build/adhoc-cicd-odoo-odoo/addons/account/models/chart_template.py", line 160, in try_loading
    return self._load(template_code, company, install_demo, force_create)
TypeError: AccountChartTemplate._load() takes 4 positional arguments but 5 were given
2025-03-25 12:53:30 ERROR server odoo.tests.suite:131
ERROR: setUpClass (odoo.addons.account_auto_transfer.tests.test_transfer_model_line.MoveModelLineTestCase)
Traceback (most recent call last):
  File "/data/build/adhoc-cicd-odoo-enterprise/account_auto_transfer/tests/test_transfer_model_line.py", line 18, in setUpClass
    super().setUpClass()
  File "/data/build/adhoc-cicd-odoo-enterprise/account_auto_transfer/tests/account_auto_transfer_test_classes.py", line 13, in setUpClass
    super().setUpClass()
  File "/data/build/adhoc-cicd-odoo-odoo/addons/account/tests/common.py", line 52, in setUpClass
    super().setUpClass()
  File "/data/build/adhoc-cicd-odoo-odoo/addons/product/tests/common.py", line 16, in setUpClass
    super().setUpClass()
  File "/data/build/adhoc-cicd-odoo-odoo/odoo/addons/base/tests/common.py", line 36, in setUpClass
    independent_company = cls.setup_independent_company()
  File "/data/build/adhoc-cicd-odoo-odoo/addons/account/tests/common.py", line 200, in setup_independent_company
    return cls._create_company(name='company_1_data', **kwargs)
  File "/data/build/adhoc-cicd-odoo-odoo/addons/account/tests/common.py", line 225, in _create_company
    cls._use_chart_template(company, cls.chart_template)
  File "/data/build/adhoc-cicd-odoo-odoo/addons/account/tests/common.py", line 263, in _use_chart_template
    cls.env['account.chart.template'].try_loading(chart_template_ref, company=company, install_demo=False)
  File "/data/build/adhoc-cicd-odoo-odoo/addons/l10n_ar/models/account_chart_template.py", line 60, in try_loading
    return super().try_loading(template_code, company, install_demo, force_create)
  File "/data/build/adhoc-cicd-odoo-odoo/addons/account/models/chart_template.py", line 160, in try_loading
    return self._load(template_code, company, install_demo, force_create)
TypeError: AccountChartTemplate._load() takes 4 positional arguments but 5 were given
2025-03-25 12:53:30 ERROR server odoo.tests.suite:131
ERROR: setUpClass (odoo.addons.stock_accountant.tests.test_reconciliation_widget.TestReconciliationWidget)
Traceback (most recent call last):
  File "/data/build/adhoc-cicd-odoo-odoo/addons/stock_account/tests/test_anglo_saxon_valuation_reconciliation_common.py", line 19, in setUpClass
    super().setUpClass()
  File "/data/build/adhoc-cicd-odoo-odoo/addons/account/tests/common.py", line 52, in setUpClass
    super().setUpClass()
  File "/data/build/adhoc-cicd-odoo-odoo/addons/product/tests/common.py", line 16, in setUpClass
    super().setUpClass()
  File "/data/build/adhoc-cicd-odoo-odoo/odoo/addons/base/tests/common.py", line 36, in setUpClass
    independent_company = cls.setup_independent_company()
  File "/data/build/adhoc-cicd-odoo-odoo/addons/account/tests/common.py", line 200, in setup_independent_company
    return cls._create_company(name='company_1_data', **kwargs)
  File "/data/build/adhoc-cicd-odoo-odoo/addons/account/tests/common.py", line 225, in _create_company
    cls._use_chart_template(company, cls.chart_template)
  File "/data/build/adhoc-cicd-odoo-odoo/addons/account/tests/common.py", line 263, in _use_chart_template
    cls.env['account.chart.template'].try_loading(chart_template_ref, company=company, install_demo=False)
  File "/data/build/adhoc-cicd-odoo-odoo/addons/l10n_ar/models/account_chart_template.py", line 60, in try_loading
    return super().try_loading(template_code, company, install_demo, force_create)
  File "/data/build/adhoc-cicd-odoo-odoo/addons/account/models/chart_template.py", line 160, in try_loading
    return self._load(template_code, company, install_demo, force_create)
TypeError: AccountChartTemplate._load() takes 4 positional arguments but 5 were given
2025-03-25 12:53:30 ERROR server odoo.tests.suite:131
ERROR: setUpClass (odoo.addons.l10n_ar.tests.test_manual.TestManual)
Traceback (most recent call last):
  File "/data/build/adhoc-cicd-odoo-odoo/addons/l10n_ar/tests/test_manual.py", line 12, in setUpClass
    super(TestManual, cls).setUpClass()
  File "/data/build/adhoc-cicd-odoo-odoo/addons/account/tests/common.py", line 45, in wrapper
    function(self)
  File "/data/build/adhoc-cicd-odoo-odoo/addons/l10n_ar/tests/common.py", line 17, in setUpClass
    super().setUpClass()
  File "/data/build/adhoc-cicd-odoo-odoo/addons/account/tests/common.py", line 52, in setUpClass
    super().setUpClass()
  File "/data/build/adhoc-cicd-odoo-odoo/addons/product/tests/common.py", line 16, in setUpClass
    super().setUpClass()
  File "/data/build/adhoc-cicd-odoo-odoo/odoo/addons/base/tests/common.py", line 36, in setUpClass
    independent_company = cls.setup_independent_company()
  File "/data/build/adhoc-cicd-odoo-odoo/addons/account/tests/common.py", line 200, in setup_independent_company
    return cls._create_company(name='company_1_data', **kwargs)
  File "/data/build/adhoc-cicd-odoo-odoo/addons/account/tests/common.py", line 225, in _create_company
    cls._use_chart_template(company, cls.chart_template)
  File "/data/build/adhoc-cicd-odoo-odoo/addons/account/tests/common.py", line 263, in _use_chart_template
    cls.env['account.chart.template'].try_loading(chart_template_ref, company=company, install_demo=False)
  File "/data/build/adhoc-cicd-odoo-odoo/addons/l10n_ar/models/account_chart_template.py", line 60, in try_loading
    return super().try_loading(template_code, company, install_demo, force_create)
  File "/data/build/adhoc-cicd-odoo-odoo/addons/account/models/chart_template.py", line 160, in try_loading
    return self._load(template_code, company, install_demo, force_create)
TypeError: AccountChartTemplate._load() takes 4 positional arguments but 5 were given
2025-03-25 12:53:36 ERROR server odoo.tests.suite:131
ERROR: setUpClass (odoo.addons.l10n_uy.tests.test_check_vat.CheckUyVat)
Traceback (most recent call last):
  File "/data/build/adhoc-cicd-odoo-odoo/addons/account/tests/common.py", line 34, in wrapper
    function(self)
  File "/data/build/adhoc-cicd-odoo-odoo/addons/l10n_uy/tests/test_check_vat.py", line 13, in setUpClass
    super().setUpClass()
  File "/data/build/adhoc-cicd-odoo-odoo/addons/account/tests/common.py", line 52, in setUpClass
    super().setUpClass()
  File "/data/build/adhoc-cicd-odoo-odoo/addons/product/tests/common.py", line 16, in setUpClass
    super().setUpClass()
  File "/data/build/adhoc-cicd-odoo-odoo/odoo/addons/base/tests/common.py", line 36, in setUpClass
    independent_company = cls.setup_independent_company()
  File "/data/build/adhoc-cicd-odoo-odoo/addons/account/tests/common.py", line 200, in setup_independent_company
    return cls._create_company(name='company_1_data', **kwargs)
  File "/data/build/adhoc-cicd-odoo-odoo/addons/account/tests/common.py", line 225, in _create_company
    cls._use_chart_template(company, cls.chart_template)
  File "/data/build/adhoc-cicd-odoo-odoo/addons/account/tests/common.py", line 263, in _use_chart_template
    cls.env['account.chart.template'].try_loading(chart_template_ref, company=company, install_demo=False)
  File "/data/build/adhoc-cicd-odoo-odoo/addons/l10n_ar/models/account_chart_template.py", line 60, in try_loading
    return super().try_loading(template_code, company, install_demo, force_create)
  File "/data/build/adhoc-cicd-odoo-odoo/addons/account/models/chart_template.py", line 160, in try_loading
    return self._load(template_code, company, install_demo, force_create)
TypeError: AccountChartTemplate._load() takes 4 positional arguments but 5 were given
2025-03-25 12:53:36 ERROR server odoo.tests.suite:131
ERROR: setUpClass (odoo.addons.l10n_uy.tests.test_doc_types.TestDocTypes)
Traceback (most recent call last):
  File "/data/build/adhoc-cicd-odoo-odoo/addons/account/tests/common.py", line 34, in wrapper
    function(self)
  File "/data/build/adhoc-cicd-odoo-odoo/addons/l10n_uy/tests/test_doc_types.py", line 13, in setUpClass
    super().setUpClass()
  File "/data/build/adhoc-cicd-odoo-odoo/addons/account/tests/common.py", line 52, in setUpClass
    super().setUpClass()
  File "/data/build/adhoc-cicd-odoo-odoo/addons/product/tests/common.py", line 16, in setUpClass
    super().setUpClass()
  File "/data/build/adhoc-cicd-odoo-odoo/odoo/addons/base/tests/common.py", line 36, in setUpClass
    independent_company = cls.setup_independent_company()
  File "/data/build/adhoc-cicd-odoo-odoo/addons/account/tests/common.py", line 200, in setup_independent_company
    return cls._create_company(name='company_1_data', **kwargs)
  File "/data/build/adhoc-cicd-odoo-odoo/addons/account/tests/common.py", line 225, in _create_company
    cls._use_chart_template(company, cls.chart_template)
  File "/data/build/adhoc-cicd-odoo-odoo/addons/account/tests/common.py", line 263, in _use_chart_template
    cls.env['account.chart.template'].try_loading(chart_template_ref, company=company, install_demo=False)
  File "/data/build/adhoc-cicd-odoo-odoo/addons/l10n_ar/models/account_chart_template.py", line 60, in try_loading
    return super().try_loading(template_code, company, install_demo, force_create)
  File "/data/build/adhoc-cicd-odoo-odoo/addons/account/models/chart_template.py", line 160, in try_loading
    return self._load(template_code, company, install_demo, force_create)
TypeError: AccountChartTemplate._load() takes 4 positional arguments but 5 were given
2025-03-25 12:53:36 ERROR server odoo.tests.suite:131
ERROR: setUpClass (odoo.addons.account_followup.tests.test_account_followup.TestAccountFollowupReports)
Traceback (most recent call last):
  File "/data/build/adhoc-cicd-odoo-enterprise/account_followup/tests/test_account_followup.py", line 17, in setUpClass
    super().setUpClass()
  File "/data/build/adhoc-cicd-odoo-odoo/addons/account/tests/common.py", line 52, in setUpClass
    super().setUpClass()
  File "/data/build/adhoc-cicd-odoo-odoo/addons/product/tests/common.py", line 16, in setUpClass
    super().setUpClass()
  File "/data/build/adhoc-cicd-odoo-odoo/odoo/addons/base/tests/common.py", line 36, in setUpClass
    independent_company = cls.setup_independent_company()
  File "/data/build/adhoc-cicd-odoo-odoo/addons/account/tests/common.py", line 200, in setup_independent_company
    return cls._create_company(name='company_1_data', **kwargs)
  File "/data/build/adhoc-cicd-odoo-odoo/addons/account/tests/common.py", line 225, in _create_company
    cls._use_chart_template(company, cls.chart_template)
  File "/data/build/adhoc-cicd-odoo-odoo/addons/account/tests/common.py", line 263, in _use_chart_template
    cls.env['account.chart.template'].try_loading(chart_template_ref, company=company, install_demo=False)
  File "/data/build/adhoc-cicd-odoo-odoo/addons/l10n_ar/models/account_chart_template.py", line 60, in try_loading
    return super().try_loading(template_code, company, install_demo, force_create)
  File "/data/build/adhoc-cicd-odoo-odoo/addons/account/models/chart_template.py", line 160, in try_loading
    return self._load(template_code, company, install_demo, force_create)
TypeError: AccountChartTemplate._load() takes 4 positional arguments but 5 were given
2025-03-25 12:53:36 ERROR server odoo.tests.suite:131
ERROR: setUpClass (odoo.addons.account_followup.tests.test_followup_report.TestAccountFollowupReports)
Traceback (most recent call last):
  File "/data/build/adhoc-cicd-odoo-enterprise/account_followup/tests/test_followup_report.py", line 17, in setUpClass
    super().setUpClass()
  File "/data/build/adhoc-cicd-odoo-enterprise/account_reports/tests/common.py", line 25, in setUpClass
    super().setUpClass()
  File "/data/build/adhoc-cicd-odoo-odoo/addons/account/tests/common.py", line 52, in setUpClass
    super().setUpClass()
  File "/data/build/adhoc-cicd-odoo-odoo/addons/product/tests/common.py", line 16, in setUpClass
    super().setUpClass()
  File "/data/build/adhoc-cicd-odoo-odoo/odoo/addons/base/tests/common.py", line 36, in setUpClass
    independent_company = cls.setup_independent_company()
  File "/data/build/adhoc-cicd-odoo-odoo/addons/account/tests/common.py", line 200, in setup_independent_company
    return cls._create_company(name='company_1_data', **kwargs)
  File "/data/build/adhoc-cicd-odoo-odoo/addons/account/tests/common.py", line 225, in _create_company
    cls._use_chart_template(company, cls.chart_template)
  File "/data/build/adhoc-cicd-odoo-odoo/addons/account/tests/common.py", line 263, in _use_chart_template
    cls.env['account.chart.template'].try_loading(chart_template_ref, company=company, install_demo=False)
  File "/data/build/adhoc-cicd-odoo-odoo/addons/l10n_ar/models/account_chart_template.py", line 60, in try_loading
    return super().try_loading(template_code, company, install_demo, force_create)
  File "/data/build/adhoc-cicd-odoo-odoo/addons/account/models/chart_template.py", line 160, in try_loading
    return self._load(template_code, company, install_demo, force_create)
TypeError: AccountChartTemplate._load() takes 4 positional arguments but 5 were given
2025-03-25 12:53:41 ERROR server odoo.tests.suite:131
ERROR: setUpClass (odoo.addons.l10n_uy_edi.tests.test_manual.TestManual)
Traceback (most recent call last):
  File "/data/build/adhoc-cicd-odoo-enterprise/l10n_uy_edi/tests/test_manual.py", line 14, in setUpClass
    super().setUpClass()
  File "/data/build/adhoc-cicd-odoo-odoo/addons/account/tests/common.py", line 34, in wrapper
    function(self)
  File "/data/build/adhoc-cicd-odoo-enterprise/l10n_uy_edi/tests/common.py", line 22, in setUpClass
    super().setUpClass()
  File "/data/build/adhoc-cicd-odoo-odoo/addons/account/tests/common.py", line 52, in setUpClass
    super().setUpClass()
  File "/data/build/adhoc-cicd-odoo-odoo/addons/product/tests/common.py", line 16, in setUpClass
    super().setUpClass()
  File "/data/build/adhoc-cicd-odoo-odoo/odoo/addons/base/tests/common.py", line 36, in setUpClass
    independent_company = cls.setup_independent_company()
  File "/data/build/adhoc-cicd-odoo-odoo/addons/account/tests/common.py", line 200, in setup_independent_company
    return cls._create_company(name='company_1_data', **kwargs)
  File "/data/build/adhoc-cicd-odoo-odoo/addons/account/tests/common.py", line 225, in _create_company
    cls._use_chart_template(company, cls.chart_template)
  File "/data/build/adhoc-cicd-odoo-odoo/addons/account/tests/common.py", line 263, in _use_chart_template
    cls.env['account.chart.template'].try_loading(chart_template_ref, company=company, install_demo=False)
  File "/data/build/adhoc-cicd-odoo-odoo/addons/l10n_ar/models/account_chart_template.py", line 60, in try_loading
    return super().try_loading(template_code, company, install_demo, force_create)
  File "/data/build/adhoc-cicd-odoo-odoo/addons/account/models/chart_template.py", line 160, in try_loading
    return self._load(template_code, company, install_demo, force_create)
TypeError: AccountChartTemplate._load() takes 4 positional arguments but 5 were given
2025-03-25 12:53:41 ERROR server odoo.tests.suite:131
ERROR: setUpClass (odoo.addons.l10n_uy_edi.tests.test_mock.TestMock)
Traceback (most recent call last):
  File "/data/build/adhoc-cicd-odoo-enterprise/l10n_uy_edi/tests/test_mock.py", line 13, in setUpClass
    super().setUpClass()
  File "/data/build/adhoc-cicd-odoo-odoo/addons/account/tests/common.py", line 34, in wrapper
    function(self)
  File "/data/build/adhoc-cicd-odoo-enterprise/l10n_uy_edi/tests/common.py", line 22, in setUpClass
    super().setUpClass()
  File "/data/build/adhoc-cicd-odoo-odoo/addons/account/tests/common.py", line 52, in setUpClass
    super().setUpClass()
  File "/data/build/adhoc-cicd-odoo-odoo/addons/product/tests/common.py", line 16, in setUpClass
    super().setUpClass()
  File "/data/build/adhoc-cicd-odoo-odoo/odoo/addons/base/tests/common.py", line 36, in setUpClass
    independent_company = cls.setup_independent_company()
  File "/data/build/adhoc-cicd-odoo-odoo/addons/account/tests/common.py", line 200, in setup_independent_company
    return cls._create_company(name='company_1_data', **kwargs)
  File "/data/build/adhoc-cicd-odoo-odoo/addons/account/tests/common.py", line 225, in _create_company
    cls._use_chart_template(company, cls.chart_template)
  File "/data/build/adhoc-cicd-odoo-odoo/addons/account/tests/common.py", line 263, in _use_chart_template
    cls.env['account.chart.template'].try_loading(chart_template_ref, company=company, install_demo=False)
  File "/data/build/adhoc-cicd-odoo-odoo/addons/l10n_ar/models/account_chart_template.py", line 60, in try_loading
    return super().try_loading(template_code, company, install_demo, force_create)
  File "/data/build/adhoc-cicd-odoo-odoo/addons/account/models/chart_template.py", line 160, in try_loading
    return self._load(template_code, company, install_demo, force_create)
TypeError: AccountChartTemplate._load() takes 4 positional arguments but 5 were given
2025-03-25 12:53:47 ERROR server odoo.tests.suite:131
ERROR: setUpClass (odoo.addons.demo_full.tests.test_document_type.TestDocumentType)
Traceback (most recent call last):
  File "/data/build/adhoc-cicd-odoo-odoo/addons/account/tests/common.py", line 45, in wrapper
    function(self)
  File "/data/build/adhoc-cicd-odoo-odoo/addons/l10n_ar/tests/common.py", line 17, in setUpClass
    super().setUpClass()
  File "/data/build/adhoc-cicd-odoo-odoo/addons/account/tests/common.py", line 52, in setUpClass
    super().setUpClass()
  File "/data/build/adhoc-cicd-odoo-odoo/addons/product/tests/common.py", line 16, in setUpClass
    super().setUpClass()
  File "/data/build/adhoc-cicd-odoo-odoo/odoo/addons/base/tests/common.py", line 36, in setUpClass
    independent_company = cls.setup_independent_company()
  File "/data/build/adhoc-cicd-odoo-odoo/addons/account/tests/common.py", line 200, in setup_independent_company
    return cls._create_company(name='company_1_data', **kwargs)
  File "/data/build/adhoc-cicd-odoo-odoo/addons/account/tests/common.py", line 225, in _create_company
    cls._use_chart_template(company, cls.chart_template)
  File "/data/build/adhoc-cicd-odoo-odoo/addons/account/tests/common.py", line 263, in _use_chart_template
    cls.env['account.chart.template'].try_loading(chart_template_ref, company=company, install_demo=False)
  File "/data/build/adhoc-cicd-odoo-odoo/addons/l10n_ar/models/account_chart_template.py", line 60, in try_loading
    return super().try_loading(template_code, company, install_demo, force_create)
  File "/data/build/adhoc-cicd-odoo-odoo/addons/account/models/chart_template.py", line 160, in try_loading
    return self._load(template_code, company, install_demo, force_create)
TypeError: AccountChartTemplate._load() takes 4 positional arguments but 5 were given
2025-03-25 12:53:58 ERROR server odoo.tests.suite:131
ERROR: setUpClass (odoo.addons.demo_full.tests.test_sale_order_type_automation.TestSaleOrderTypeAutomation)
Traceback (most recent call last):
  File "/data/build/adhoc-cicd-odoo-odoo/odoo/tools/cache.py", line 103, in lookup
    r = d[key]
  File "<decorator-gen-6>", line 2, in __getitem__
  File "/data/build/adhoc-cicd-odoo-odoo/odoo/tools/func.py", line 97, in locked
    return func(inst, *args, **kwargs)
  File "/data/build/adhoc-cicd-odoo-odoo/odoo/tools/lru.py", line 33, in __getitem__
    a = self.d[obj]
KeyError: ('ir.model.data', <function IrModelData._xmlid_lookup at 0x7f7e655c1bd0>, 'base.company_ri')
During handling of the above exception, another exception occurred:
Traceback (most recent call last):
  File "/data/build/ingadhoc-ingadhoc-demo/demo_full/tests/test_sale_order_type_automation.py", line 13, in setUpClass
    cls.env.company = cls.env.ref("base.company_ri")
  File "/data/build/adhoc-cicd-odoo-odoo/odoo/api.py", line 658, in ref
    res_model, res_id = self['ir.model.data']._xmlid_to_res_model_res_id(
  File "/data/build/adhoc-cicd-odoo-odoo/odoo/addons/base/models/ir_model.py", line 2246, in _xmlid_to_res_model_res_id
    return self._xmlid_lookup(xmlid)
  File "<decorator-gen-44>", line 2, in _xmlid_lookup
  File "/data/build/adhoc-cicd-odoo-odoo/odoo/tools/cache.py", line 110, in lookup
    value = d[key] = self.method(*args, **kwargs)
  File "/data/build/adhoc-cicd-odoo-odoo/odoo/addons/base/models/ir_model.py", line 2239, in _xmlid_lookup
    raise ValueError('External ID not found in the system: %s' % xmlid)
ValueError: External ID not found in the system: base.company_ri
2025-03-25 12:53:58 ERROR server odoo.tests.suite:131
ERROR: setUpClass (odoo.addons.demo_full.tests.test_sale_three_discounts.TestSaleThreeDiscounts)
Traceback (most recent call last):
  File "/data/build/adhoc-cicd-odoo-odoo/odoo/tools/cache.py", line 103, in lookup
    r = d[key]
  File "<decorator-gen-6>", line 2, in __getitem__
  File "/data/build/adhoc-cicd-odoo-odoo/odoo/tools/func.py", line 97, in locked
    return func(inst, *args, **kwargs)
  File "/data/build/adhoc-cicd-odoo-odoo/odoo/tools/lru.py", line 33, in __getitem__
    a = self.d[obj]
KeyError: ('ir.model.data', <function IrModelData._xmlid_lookup at 0x7f7e655c1bd0>, 'base.company_ri')
During handling of the above exception, another exception occurred:
Traceback (most recent call last):
  File "/data/build/ingadhoc-ingadhoc-demo/demo_full/tests/test_sale_three_discounts.py", line 15, in setUpClass
    cls.env.company = cls.env.ref("base.company_ri")
  File "/data/build/adhoc-cicd-odoo-odoo/odoo/api.py", line 658, in ref
    res_model, res_id = self['ir.model.data']._xmlid_to_res_model_res_id(
  File "/data/build/adhoc-cicd-odoo-odoo/odoo/addons/base/models/ir_model.py", line 2246, in _xmlid_to_res_model_res_id
    return self._xmlid_lookup(xmlid)
  File "<decorator-gen-44>", line 2, in _xmlid_lookup
  File "/data/build/adhoc-cicd-odoo-odoo/odoo/tools/cache.py", line 110, in lookup
    value = d[key] = self.method(*args, **kwargs)
  File "/data/build/adhoc-cicd-odoo-odoo/odoo/addons/base/models/ir_model.py", line 2239, in _xmlid_lookup
    raise ValueError('External ID not found in the system: %s' % xmlid)
ValueError: External ID not found in the system: base.company_ri
2025-03-25 12:53:58 ERROR server odoo.tests.suite:131
ERROR: setUpClass (odoo.addons.demo_full.tests.test_website_sale.TestWebsiteSale)
Traceback (most recent call last):
  File "/data/build/adhoc-cicd-odoo-odoo/odoo/tools/cache.py", line 103, in lookup
    r = d[key]
  File "<decorator-gen-6>", line 2, in __getitem__
  File "/data/build/adhoc-cicd-odoo-odoo/odoo/tools/func.py", line 97, in locked
    return func(inst, *args, **kwargs)
  File "/data/build/adhoc-cicd-odoo-odoo/odoo/tools/lru.py", line 33, in __getitem__
    a = self.d[obj]
KeyError: ('ir.model.data', <function IrModelData._xmlid_lookup at 0x7f7e655c1bd0>, 'base.company_ri')
During handling of the above exception, another exception occurred:
Traceback (most recent call last):
  File "/data/build/ingadhoc-ingadhoc-demo/demo_full/tests/test_website_sale.py", line 10, in setUpClass
    company = cls.env.ref("base.company_ri")
  File "/data/build/adhoc-cicd-odoo-odoo/odoo/api.py", line 658, in ref
    res_model, res_id = self['ir.model.data']._xmlid_to_res_model_res_id(
  File "/data/build/adhoc-cicd-odoo-odoo/odoo/addons/base/models/ir_model.py", line 2246, in _xmlid_to_res_model_res_id
    return self._xmlid_lookup(xmlid)
  File "<decorator-gen-44>", line 2, in _xmlid_lookup
  File "/data/build/adhoc-cicd-odoo-odoo/odoo/tools/cache.py", line 110, in lookup
    value = d[key] = self.method(*args, **kwargs)
  File "/data/build/adhoc-cicd-odoo-odoo/odoo/addons/base/models/ir_model.py", line 2239, in _xmlid_lookup
    raise ValueError('External ID not found in the system: %s' % xmlid)
ValueError: External ID not found in the system: base.company_ri
2025-03-25 12:53:58 ERROR server odoo.tests.result:594 0 failed, 24 error(s) of 218 tests when loading database '134526-18-0-all'
2025-03-25 12:54:12 INFO runbot Getting results for build 134526-18-0
2025-03-25 12:54:12 Step all finished in 16m
2025-03-25 12:54:12 Starting step setup from config Adhoc Conf con tests 17+
2025-03-25 12:54:12 INFO runbot Using Dockerfile Tag odoo:adhoc-odoo-18
2025-03-25 12:54:13 INFO runbot Step setup finished in 1s
2025-03-25 12:54:13 Starting step run from config Adhoc Conf con tests 17+
2025-03-25 12:54:13 INFO runbot Start running build 134526-18-0
2025-03-25 12:54:13 INFO runbot Using Dockerfile Tag odoo:adhoc-odoo-18
2025-03-25 12:54:20 INFO server odoo.modules.loading:357 1 modules loaded in 0.01s, 0 queries (+0 extra)
2025-03-25 12:54:20 INFO server odoo.modules.loading:357 19 modules loaded in 0.54s, 0 queries (+0 extra)
2025-03-25 13:37:10 INFO server odoo.addons.l10n_ar_currency_update.models.res_company:36 Currency Provider configured as AFIP for next companies: arg
2025-03-25 13:37:10 ERROR server odoo.http:2407
Exception during request handling.
Traceback (most recent call last):
  File "/data/build/adhoc-cicd-odoo-odoo/odoo/http.py", line 2372, in __call__
    response = request._serve_db()
  File "/data/build/adhoc-cicd-odoo-odoo/odoo/http.py", line 1899, in _serve_db
    return self._transactioning(
  File "/data/build/adhoc-cicd-odoo-odoo/odoo/http.py", line 1962, in _transactioning
    return service_model.retrying(func, env=self.env)
  File "/data/build/adhoc-cicd-odoo-odoo/odoo/service/model.py", line 158, in retrying
    env.cr.flush()  # submit the changes to the database
  File "/data/build/adhoc-cicd-odoo-odoo/odoo/sql_db.py", line 160, in flush
    self.precommit.run()
  File "/data/build/adhoc-cicd-odoo-odoo/odoo/tools/misc.py", line 1161, in run
    func()
  File "/data/build/adhoc-cicd-odoo-odoo/addons/account/models/company.py", line 884, in try_loading
    env['account.chart.template'].try_loading(
  File "/data/build/adhoc-cicd-odoo-odoo/addons/l10n_ar/models/account_chart_template.py", line 60, in try_loading
    return super().try_loading(template_code, company, install_demo, force_create)
  File "/data/build/adhoc-cicd-odoo-odoo/addons/account/models/chart_template.py", line 160, in try_loading
    return self._load(template_code, company, install_demo, force_create)
TypeError: AccountChartTemplate._load() takes 4 positional arguments but 5 were given
2025-03-25 13:37:16 INFO server odoo.addons.l10n_ar_currency_update.models.res_company:36 Currency Provider configured as AFIP for next companies: arg
2025-03-25 13:37:21 ERROR server odoo.http:2407
Exception during request handling.
Traceback (most recent call last):
  File "/data/build/adhoc-cicd-odoo-odoo/odoo/http.py", line 2372, in __call__
    response = request._serve_db()
  File "/data/build/adhoc-cicd-odoo-odoo/odoo/http.py", line 1899, in _serve_db
    return self._transactioning(
  File "/data/build/adhoc-cicd-odoo-odoo/odoo/http.py", line 1962, in _transactioning
    return service_model.retrying(func, env=self.env)
  File "/data/build/adhoc-cicd-odoo-odoo/odoo/service/model.py", line 158, in retrying
    env.cr.flush()  # submit the changes to the database
  File "/data/build/adhoc-cicd-odoo-odoo/odoo/sql_db.py", line 160, in flush
    self.precommit.run()
  File "/data/build/adhoc-cicd-odoo-odoo/odoo/tools/misc.py", line 1161, in run
    func()
  File "/data/build/adhoc-cicd-odoo-odoo/addons/account/models/company.py", line 884, in try_loading
    env['account.chart.template'].try_loading(
  File "/data/build/adhoc-cicd-odoo-odoo/addons/l10n_ar/models/account_chart_template.py", line 60, in try_loading
    return super().try_loading(template_code, company, install_demo, force_create)
  File "/data/build/adhoc-cicd-odoo-odoo/addons/account/models/chart_template.py", line 160, in try_loading
    return self._load(template_code, company, install_demo, force_create)
TypeError: AccountChartTemplate._load() takes 4 positional arguments but 5 were given
2025-03-25 13:37:27 INFO server odoo.addons.l10n_ar_currency_update.models.res_company:36 Currency Provider configured as AFIP for next companies: arg
2025-03-25 13:37:27 ERROR server odoo.http:2407
Exception during request handling.
Traceback (most recent call last):
  File "/data/build/adhoc-cicd-odoo-odoo/odoo/http.py", line 2372, in __call__
    response = request._serve_db()
  File "/data/build/adhoc-cicd-odoo-odoo/odoo/http.py", line 1899, in _serve_db
    return self._transactioning(
  File "/data/build/adhoc-cicd-odoo-odoo/odoo/http.py", line 1962, in _transactioning
    return service_model.retrying(func, env=self.env)
  File "/data/build/adhoc-cicd-odoo-odoo/odoo/service/model.py", line 158, in retrying
    env.cr.flush()  # submit the changes to the database
  File "/data/build/adhoc-cicd-odoo-odoo/odoo/sql_db.py", line 160, in flush
    self.precommit.run()
  File "/data/build/adhoc-cicd-odoo-odoo/odoo/tools/misc.py", line 1161, in run
    func()
  File "/data/build/adhoc-cicd-odoo-odoo/addons/account/models/company.py", line 884, in try_loading
    env['account.chart.template'].try_loading(
  File "/data/build/adhoc-cicd-odoo-odoo/addons/l10n_ar/models/account_chart_template.py", line 60, in try_loading
    return super().try_loading(template_code, company, install_demo, force_create)
  File "/data/build/adhoc-cicd-odoo-odoo/addons/account/models/chart_template.py", line 160, in try_loading
    return self._load(template_code, company, install_demo, force_create)
TypeError: AccountChartTemplate._load() takes 4 positional arguments but 5 were given
2025-03-25 13:37:33 INFO server odoo.addons.l10n_ar_currency_update.models.res_company:36 Currency Provider configured as AFIP for next companies: arg
2025-03-25 13:37:38 ERROR server odoo.http:2407
Exception during request handling.
Traceback (most recent call last):
  File "/data/build/adhoc-cicd-odoo-odoo/odoo/http.py", line 2372, in __call__
    response = request._serve_db()
  File "/data/build/adhoc-cicd-odoo-odoo/odoo/http.py", line 1899, in _serve_db
    return self._transactioning(
  File "/data/build/adhoc-cicd-odoo-odoo/odoo/http.py", line 1962, in _transactioning
    return service_model.retrying(func, env=self.env)
  File "/data/build/adhoc-cicd-odoo-odoo/odoo/service/model.py", line 158, in retrying
    env.cr.flush()  # submit the changes to the database
  File "/data/build/adhoc-cicd-odoo-odoo/odoo/sql_db.py", line 160, in flush
    self.precommit.run()
  File "/data/build/adhoc-cicd-odoo-odoo/odoo/tools/misc.py", line 1161, in run
    func()
  File "/data/build/adhoc-cicd-odoo-odoo/addons/account/models/company.py", line 884, in try_loading
    env['account.chart.template'].try_loading(
  File "/data/build/adhoc-cicd-odoo-odoo/addons/l10n_ar/models/account_chart_template.py", line 60, in try_loading
    return super().try_loading(template_code, company, install_demo, force_create)
  File "/data/build/adhoc-cicd-odoo-odoo/addons/account/models/chart_template.py", line 160, in try_loading
    return self._load(template_code, company, install_demo, force_create)
TypeError: AccountChartTemplate._load() takes 4 positional arguments but 5 were given
2025-03-25 13:37:38 INFO server odoo.addons.l10n_ar_currency_update.models.res_company:36 Currency Provider configured as AFIP for next companies: arg
2025-03-25 13:37:38 ERROR server odoo.http:2407
Exception during request handling.
Traceback (most recent call last):
  File "/data/build/adhoc-cicd-odoo-odoo/odoo/http.py", line 2372, in __call__
    response = request._serve_db()
  File "/data/build/adhoc-cicd-odoo-odoo/odoo/http.py", line 1899, in _serve_db
    return self._transactioning(
  File "/data/build/adhoc-cicd-odoo-odoo/odoo/http.py", line 1962, in _transactioning
    return service_model.retrying(func, env=self.env)
  File "/data/build/adhoc-cicd-odoo-odoo/odoo/service/model.py", line 158, in retrying
    env.cr.flush()  # submit the changes to the database
  File "/data/build/adhoc-cicd-odoo-odoo/odoo/sql_db.py", line 160, in flush
    self.precommit.run()
  File "/data/build/adhoc-cicd-odoo-odoo/odoo/tools/misc.py", line 1161, in run
    func()
  File "/data/build/adhoc-cicd-odoo-odoo/addons/account/models/company.py", line 884, in try_loading
    env['account.chart.template'].try_loading(
  File "/data/build/adhoc-cicd-odoo-odoo/addons/l10n_ar/models/account_chart_template.py", line 60, in try_loading
    return super().try_loading(template_code, company, install_demo, force_create)
  File "/data/build/adhoc-cicd-odoo-odoo/addons/account/models/chart_template.py", line 160, in try_loading
    return self._load(template_code, company, install_demo, force_create)
TypeError: AccountChartTemplate._load() takes 4 positional arguments but 5 were given
2025-03-25 14:24:57 WARNING server odoo.http:725 <function odoo.addons.stock_batch_picking_voucher.controllers.main.report_download> called ignoring args {'token'}
2025-03-25 14:25:08 WARNING server odoo.http:725 <function odoo.addons.stock_batch_picking_voucher.controllers.main.report_download> called ignoring args {'token'}
2025-03-25 14:29:24 WARNING server odoo.http:725 <function odoo.addons.stock_batch_picking_voucher.controllers.main.report_download> called ignoring args {'token'}
2025-03-25 14:29:52 WARNING server odoo.http:725 <function odoo.addons.stock_batch_picking_voucher.controllers.main.report_download> called ignoring args {'token'}
2025-03-25 14:30:30 WARNING server odoo.http:725 <function odoo.addons.stock_batch_picking_voucher.controllers.main.report_download> called ignoring args {'token'}
2025-03-25 14:30:46 WARNING server odoo.http:725 <function odoo.addons.stock_batch_picking_voucher.controllers.main.report_download> called ignoring args {'token'}
2025-03-25 14:31:09 WARNING server odoo.http:2405 Primero debe seleccionar un talonario
2025-03-25 14:31:14 WARNING server odoo.http:725 <function odoo.addons.stock_batch_picking_voucher.controllers.main.report_download> called ignoring args {'token'}
2025-03-25 14:31:31 WARNING server odoo.http:725 <function odoo.addons.stock_batch_picking_voucher.controllers.main.report_download> called ignoring args {'token'}
2025-03-25 14:44:54 INFO server odoo.modules.loading:357 1 modules loaded in 0.01s, 0 queries (+0 extra)
2025-03-25 14:44:59 INFO server odoo.modules.loading:357 641 modules loaded in 0.55s, 0 queries (+0 extra)
2025-03-25 14:45:10 INFO server odoo.modules.loading:357 653 modules loaded in 14.20s, 4708 queries (+4708 extra)
2025-03-25 14:45:38 INFO server odoo.modules.loading:357 1 modules loaded in 0.01s, 0 queries (+0 extra)
2025-03-25 14:45:38 INFO server odoo.modules.loading:357 653 modules loaded in 0.45s, 0 queries (+0 extra)
2025-03-25 15:40:34 INFO runbot Kill build 134526-18-0
2025-03-25 17:12:49 Waking up build
2025-03-25 17:12:49 INFO runbot Start running build 134526-18-0
2025-03-25 17:12:49 INFO runbot Using Dockerfile Tag odoo:adhoc-odoo-18
2025-03-25 17:12:56 INFO server odoo.modules.loading:357 1 modules loaded in 0.01s, 0 queries (+0 extra)
2025-03-25 17:12:56 INFO server odoo.modules.loading:357 19 modules loaded in 0.47s, 0 queries (+0 extra)
2025-03-25 17:47:16 ERROR server odoo.http:2407
Exception during request handling.
Traceback (most recent call last):
  File "/data/build/adhoc-cicd-odoo-odoo/odoo/models.py", line 6223, in ensure_one
    _id, = self._ids
ValueError: not enough values to unpack (expected 1, got 0)
During handling of the above exception, another exception occurred:
Traceback (most recent call last):
  File "/data/build/adhoc-cicd-odoo-odoo/odoo/http.py", line 2372, in __call__
    response = request._serve_db()
  File "/data/build/adhoc-cicd-odoo-odoo/odoo/http.py", line 1899, in _serve_db
    return self._transactioning(
  File "/data/build/adhoc-cicd-odoo-odoo/odoo/http.py", line 1962, in _transactioning
    return service_model.retrying(func, env=self.env)
  File "/data/build/adhoc-cicd-odoo-odoo/odoo/service/model.py", line 156, in retrying
    result = func()
  File "/data/build/adhoc-cicd-odoo-odoo/odoo/http.py", line 1929, in _serve_ir_http
    response = self.dispatcher.dispatch(rule.endpoint, args)
  File "/data/build/adhoc-cicd-odoo-odoo/odoo/http.py", line 2177, in dispatch
    result = self.request.registry['ir.http']._dispatch(endpoint)
  File "/data/build/adhoc-cicd-odoo-odoo/odoo/addons/base/models/ir_http.py", line 333, in _dispatch
    result = endpoint(**request.params)
  File "/data/build/adhoc-cicd-odoo-odoo/odoo/http.py", line 727, in route_wrapper
    result = endpoint(self, *args, **params_ok)
  File "/data/build/adhoc-cicd-odoo-odoo/addons/web/controllers/dataset.py", line 36, in call_kw
    return call_kw(request.env[model], method, args, kwargs)
  File "/data/build/adhoc-cicd-odoo-odoo/odoo/api.py", line 533, in call_kw
    result = getattr(recs, name)(*args, **kwargs)
  File "/data/build/adhoc-cicd-odoo-odoo/addons/web/models/models.py", line 46, in web_search_read
    values_records = records.web_read(specification)
  File "/data/build/ingadhoc-multi-company/account_multicompany_ux/models/res_company_property_mixin.py", line 15, in web_read
    return super().web_read(specification)
  File "/data/build/adhoc-cicd-odoo-odoo/addons/web/models/models.py", line 86, in web_read
    values_list: list[dict] = self.read(fields_to_read, load=None)
  File "/data/build/adhoc-cicd-odoo-odoo/odoo/models.py", line 3814, in read
    return self._read_format(fnames=fields, load=load)
  File "/data/build/adhoc-cicd-odoo-odoo/odoo/models.py", line 4045, in _read_format
    vals[name] = convert(record[name], record, use_display_name)
  File "/data/build/adhoc-cicd-odoo-odoo/odoo/models.py", line 7029, in __getitem__
    return self._fields[key].__get__(self)
  File "/data/build/adhoc-cicd-odoo-odoo/odoo/fields.py", line 1303, in __get__
    self.compute_value(recs)
  File "/data/build/adhoc-cicd-odoo-odoo/odoo/fields.py", line 1485, in compute_value
    records._compute_field_value(self)
  File "/data/build/adhoc-cicd-odoo-odoo/addons/mail/models/mail_thread.py", line 429, in _compute_field_value
    return super()._compute_field_value(field)
  File "/data/build/adhoc-cicd-odoo-odoo/odoo/models.py", line 5251, in _compute_field_value
    fields.determine(field.compute, self)
  File "/data/build/adhoc-cicd-odoo-odoo/odoo/fields.py", line 110, in determine
    return needle(*args)
  File "/data/build/adhoc-cicd-odoo-odoo/addons/account_edi_ubl_cii/models/res_partner.py", line 195, in _compute_invoice_edi_format
    super()._compute_invoice_edi_format()
  File "/data/build/adhoc-cicd-odoo-odoo/addons/account/models/partner.py", line 678, in _compute_invoice_edi_format
    partner.invoice_edi_format = partner.commercial_partner_id.invoice_edi_format_store or partner.commercial_partner_id._get_suggested_invoice_edi_format()
  File "/data/build/adhoc-cicd-odoo-odoo/addons/account/models/partner.py", line 713, in _get_suggested_invoice_edi_format
    self.ensure_one()
  File "/data/build/adhoc-cicd-odoo-odoo/odoo/models.py", line 6226, in ensure_one
    raise ValueError("Expected singleton: %s" % self)
ValueError: Expected singleton: res.partner()
2025-03-25 17:56:42 ERROR server odoo.http:2407
Exception during request handling.
Traceback (most recent call last):
  File "/data/build/adhoc-cicd-odoo-odoo/odoo/models.py", line 6223, in ensure_one
    _id, = self._ids
ValueError: not enough values to unpack (expected 1, got 0)
During handling of the above exception, another exception occurred:
Traceback (most recent call last):
  File "/data/build/adhoc-cicd-odoo-odoo/odoo/http.py", line 2372, in __call__
    response = request._serve_db()
  File "/data/build/adhoc-cicd-odoo-odoo/odoo/http.py", line 1899, in _serve_db
    return self._transactioning(
  File "/data/build/adhoc-cicd-odoo-odoo/odoo/http.py", line 1962, in _transactioning
    return service_model.retrying(func, env=self.env)
  File "/data/build/adhoc-cicd-odoo-odoo/odoo/service/model.py", line 156, in retrying
    result = func()
  File "/data/build/adhoc-cicd-odoo-odoo/odoo/http.py", line 1929, in _serve_ir_http
    response = self.dispatcher.dispatch(rule.endpoint, args)
  File "/data/build/adhoc-cicd-odoo-odoo/odoo/http.py", line 2177, in dispatch
    result = self.request.registry['ir.http']._dispatch(endpoint)
  File "/data/build/adhoc-cicd-odoo-odoo/odoo/addons/base/models/ir_http.py", line 333, in _dispatch
    result = endpoint(**request.params)
  File "/data/build/adhoc-cicd-odoo-odoo/odoo/http.py", line 727, in route_wrapper
    result = endpoint(self, *args, **params_ok)
  File "/data/build/adhoc-cicd-odoo-odoo/addons/web/controllers/dataset.py", line 36, in call_kw
    return call_kw(request.env[model], method, args, kwargs)
  File "/data/build/adhoc-cicd-odoo-odoo/odoo/api.py", line 533, in call_kw
    result = getattr(recs, name)(*args, **kwargs)
  File "/data/build/adhoc-cicd-odoo-odoo/addons/web/models/models.py", line 46, in web_search_read
    values_records = records.web_read(specification)
  File "/data/build/ingadhoc-multi-company/account_multicompany_ux/models/res_company_property_mixin.py", line 15, in web_read
    return super().web_read(specification)
  File "/data/build/adhoc-cicd-odoo-odoo/addons/web/models/models.py", line 86, in web_read
    values_list: list[dict] = self.read(fields_to_read, load=None)
  File "/data/build/adhoc-cicd-odoo-odoo/odoo/models.py", line 3814, in read
    return self._read_format(fnames=fields, load=load)
  File "/data/build/adhoc-cicd-odoo-odoo/odoo/models.py", line 4045, in _read_format
    vals[name] = convert(record[name], record, use_display_name)
  File "/data/build/adhoc-cicd-odoo-odoo/odoo/models.py", line 7029, in __getitem__
    return self._fields[key].__get__(self)
  File "/data/build/adhoc-cicd-odoo-odoo/odoo/fields.py", line 1303, in __get__
    self.compute_value(recs)
  File "/data/build/adhoc-cicd-odoo-odoo/odoo/fields.py", line 1485, in compute_value
    records._compute_field_value(self)
  File "/data/build/adhoc-cicd-odoo-odoo/addons/mail/models/mail_thread.py", line 429, in _compute_field_value
    return super()._compute_field_value(field)
  File "/data/build/adhoc-cicd-odoo-odoo/odoo/models.py", line 5251, in _compute_field_value
    fields.determine(field.compute, self)
  File "/data/build/adhoc-cicd-odoo-odoo/odoo/fields.py", line 110, in determine
    return needle(*args)
  File "/data/build/adhoc-cicd-odoo-odoo/addons/account_edi_ubl_cii/models/res_partner.py", line 195, in _compute_invoice_edi_format
    super()._compute_invoice_edi_format()
  File "/data/build/adhoc-cicd-odoo-odoo/addons/account/models/partner.py", line 678, in _compute_invoice_edi_format
    partner.invoice_edi_format = partner.commercial_partner_id.invoice_edi_format_store or partner.commercial_partner_id._get_suggested_invoice_edi_format()
  File "/data/build/adhoc-cicd-odoo-odoo/addons/account/models/partner.py", line 713, in _get_suggested_invoice_edi_format
    self.ensure_one()
  File "/data/build/adhoc-cicd-odoo-odoo/odoo/models.py", line 6226, in ensure_one
    raise ValueError("Expected singleton: %s" % self)
ValueError: Expected singleton: res.partner()
2025-03-25 20:19:29 INFO runbot Kill build 134526-18-0