Date | Level | Type | Message |
---|---|---|---|
2025-02-20 12:47:50 | INFO | runbot | Init build environment with config Adhoc Conf for demo (y personalizaciones) 17+ |
2025-02-20 12:47:50 | Starting step all_no_test from config Adhoc Conf for demo (y personalizaciones) 17+ | ||
2025-02-20 12:47:50 | INFO | runbot | Using Dockerfile Tag odoo:adhoc-odoo-18 |
2025-02-20 12:48:27 | INFO | server | odoo.modules.loading:329 1 modules loaded in 11.02s, 9222 queries (+9222 extra) |
2025-02-20 12:55:05 | INFO | server | odoo.addons.l10n_ar_edi.models.res_company:128 Setting demo certificate from False to AR demo certificate 10 in (AR) Responsable Inscripto company |
2025-02-20 12:55:05 | INFO | server | odoo.addons.l10n_ar_edi.models.res_company:128 Setting demo certificate from False to AR demo certificate 5 in (AR) Monotributista company |
2025-02-20 12:55:05 | INFO | server | odoo.addons.l10n_ar_edi.models.res_company:128 Setting demo certificate from False to AR demo certificate 10 in (AR) Exento company |
2025-02-20 12:56:19 | INFO | server | odoo.addons.l10n_ar_currency_update.models.res_company:36 Currency Provider configured as AFIP for next companies: (AR) Exento, (AR) Monotributista, (AR) Responsable Inscripto |
2025-02-20 12:57:38 | INFO | server | odoo.addons.l10n_ar_currency_update.models.res_company:36 Currency Provider configured as AFIP for next companies: (AR) Exento, (AR) Monotributista, Muebleria ARG |
2025-02-20 12:59:55 | CRITICAL | server | odoo.modules.module:412 Couldn't load module demo_services_minimal |
2025-02-20 12:59:55 | WARNING | server | odoo.modules.loading:632 Transient module states were reset |
This error is already known. | |||
2025-02-20 12:59:55 | ERROR | server | odoo.modules.registry:132 Failed to load registry |
2025-02-20 12:59:55 | CRITICAL | server |
odoo.service.server:1356
Failed to initialize database `126471-18-0-all`. Traceback (most recent call last): File "/data/build/adhoc-cicd-odoo-odoo/odoo/service/server.py", line 1318, in preload_registries registry = Registry.new(dbname, update_module=update_module) File "<decorator-gen-13>", line 2, in new File "/data/build/adhoc-cicd-odoo-odoo/odoo/tools/func.py", line 97, in locked return func(inst, *args, **kwargs) File "/data/build/adhoc-cicd-odoo-odoo/odoo/modules/registry.py", line 127, in new odoo.modules.load_modules(registry, force_demo, status, update_module) File "/data/build/adhoc-cicd-odoo-odoo/odoo/modules/loading.py", line 480, in load_modules processed_modules += load_marked_modules(env, graph, File "/data/build/adhoc-cicd-odoo-odoo/odoo/modules/loading.py", line 364, in load_marked_modules loaded, processed = load_module_graph( File "/data/build/adhoc-cicd-odoo-odoo/odoo/modules/loading.py", line 185, in load_module_graph load_openerp_module(package.name) File "/data/build/adhoc-cicd-odoo-odoo/odoo/modules/module.py", line 384, in load_openerp_module __import__(qualname) File "/data/build/ingadhoc-demo-demo/demo_services_minimal/__init__.py", line 1, in <module> from . import demo_py ImportError: cannot import name 'demo_py' from partially initialized module 'odoo.addons.demo_services_minimal' (most likely due to a circular import) (/data/build/ingadhoc-demo-demo/demo_services_minimal/__init__.py) |
2025-02-20 13:00:08 | Step all_no_test finished in 12m | ||
2025-02-20 13:00:08 | Starting step setup from config Adhoc Conf for demo (y personalizaciones) 17+ | ||
2025-02-20 13:00:08 | INFO | runbot | Using Dockerfile Tag odoo:adhoc-odoo-18 |
2025-02-20 13:00:09 | INFO | runbot | Step setup finished in 0s |
2025-02-20 13:00:09 | Starting step run from config Adhoc Conf for demo (y personalizaciones) 17+ | ||
2025-02-20 13:00:09 | INFO | runbot | Start running build 126471-18-0 |
2025-02-20 13:00:10 | INFO | runbot | Using Dockerfile Tag odoo:adhoc-odoo-18 |
2025-02-20 13:00:12 | INFO | server | odoo.modules.loading:329 1 modules loaded in 0.01s, 0 queries (+0 extra) |
2025-02-20 13:00:20 | INFO | server | odoo.modules.loading:329 358 modules loaded in 4.93s, 0 queries (+0 extra) |
2025-02-20 13:00:38 | ERROR | server |
odoo.addons.mail.models.mail_mail:266
Failed processing mail queue Traceback (most recent call last): File "/data/build/adhoc-cicd-odoo-odoo/addons/mail/models/mail_mail.py", line 264, in process_email_queue res = self.browse(send_ids).send(auto_commit=auto_commit, post_send_callback=post_send_callback) TypeError: MailMail.send() got an unexpected keyword argument 'post_send_callback' |
2025-02-20 13:49:40 | ERROR | server |
odoo.addons.mail.models.mail_mail:266
Failed processing mail queue Traceback (most recent call last): File "/data/build/adhoc-cicd-odoo-odoo/addons/mail/models/mail_mail.py", line 264, in process_email_queue res = self.browse(send_ids).send(auto_commit=auto_commit, post_send_callback=post_send_callback) TypeError: MailMail.send() got an unexpected keyword argument 'post_send_callback' |
2025-02-20 14:49:06 | ERROR | server |
odoo.addons.mail.models.mail_mail:266
Failed processing mail queue Traceback (most recent call last): File "/data/build/adhoc-cicd-odoo-odoo/addons/mail/models/mail_mail.py", line 264, in process_email_queue res = self.browse(send_ids).send(auto_commit=auto_commit, post_send_callback=post_send_callback) TypeError: MailMail.send() got an unexpected keyword argument 'post_send_callback' |
2025-02-20 15:49:01 | ERROR | server |
odoo.addons.mail.models.mail_mail:266
Failed processing mail queue Traceback (most recent call last): File "/data/build/adhoc-cicd-odoo-odoo/addons/mail/models/mail_mail.py", line 264, in process_email_queue res = self.browse(send_ids).send(auto_commit=auto_commit, post_send_callback=post_send_callback) TypeError: MailMail.send() got an unexpected keyword argument 'post_send_callback' |
2025-02-20 15:49:11 | INFO | runbot | Kill build 126471-18-0 |