Commit: ingadhoc/multi-store:a8a11aca
Subject: [13.0] [IMP] stock_multi_store: Add multi tag widget for warehouse
Author: Nicolás Mac Rouillon
Committer: Nicolás Mac Rouillon
Commit: ingadhoc/aeroo_reports:6ce997aa
Subject: Fix bad syntax
Author: Lucas Soto
Committer: Juan José Scarafía
Commit: ingadhoc/partner:1e492a95
Subject: [FIX] partner_internal_code: remove broken translations
Author: Juan Jose Scarafia
Committer: Juan José Scarafía
Commit: ingadhoc/project:894af084
Subject: [IMP] clean travis/oca deps
Author: Juan Jose Scarafia
Committer: Juan Jose Scarafia
Commit: ingadhoc/hr:1064d483
Subject: [REF]
Author: Juan Jose Scarafia
Committer: Juan José Scarafía
Commit: enterprise:161bff43
Subject: [FIX] account: Check Move Status Before Posting
Author: Julien CHEVREAU (JCU)
Committer: Julien CHEVREAU (JCU)
Commit: odoo:c04be6be
Subject: [FIX] website_slides: fix compute field when editing the form view with studio
Author: Dharmraj Jhala
Committer: Djamel (otd)
Commit: oca/web:583b4afe
Subject: web_widget_numeric_step 13.0.1.1.0
Author: OCA-git-bot
Committer: OCA-git-bot
Version: 13.0
Config: Adhoc Conf
Total time: 12m

Date Level Type Message
2021-04-06 20:10:16 INFO runbot Init build environment with config Adhoc Conf
2021-04-06 20:10:16 Starting step base from config Adhoc Conf
2021-04-06 20:10:16 INFO runbot Using Dockerfile Tag odoo:DockerDefaultadhocv13
2021-04-06 20:10:44 INFO server odoo.modules.loading:279 1 modules loaded in 6.38s, 0 queries
2021-04-06 20:10:52 INFO server odoo.modules.loading:279 11 modules loaded in 5.63s, 0 queries
2021-04-06 20:10:53 Step base finished in 37s
2021-04-06 20:10:53 Starting step all from config Adhoc Conf
2021-04-06 20:10:53 INFO runbot Using Dockerfile Tag odoo:DockerDefaultadhocv13
2021-04-06 20:11:43 INFO server odoo.modules.module:613 odoo.addons.base.tests.test_translate tested in 8.66s, 952 queries
2021-04-06 20:11:47 INFO server odoo.modules.loading:279 1 modules loaded in 32.51s, 20568 queries
2021-04-06 20:12:26 INFO server odoo.modules.module:613 odoo.addons.product.tests.test_variants tested in 7.22s, 15689 queries
2021-04-06 20:12:54 INFO server odoo.modules.module:613 odoo.addons.stock.tests.test_move tested in 6.84s, 12662 queries
2021-04-06 20:13:04 INFO server odoo.modules.module:613 odoo.addons.stock.tests.test_move2 tested in 9.96s, 18274 queries
2021-04-06 20:13:17 INFO server odoo.modules.module:613 odoo.addons.stock.tests.test_stock_flow tested in 7.75s, 13864 queries
2021-04-06 20:14:07 INFO server odoo.modules.module:613 odoo.addons.stock_account.tests.test_stockvaluation tested in 9.10s, 14042 queries
2021-04-06 20:14:19 INFO server odoo.modules.module:613 odoo.addons.stock_account.tests.test_stockvaluationlayer tested in 12.17s, 19897 queries
2021-04-06 20:14:31 INFO server odoo.modules.module:613 odoo.addons.project_timesheet_synchro.tests.test_ui tested in 5.67s, 1982 queries
2021-04-06 20:14:35 ERROR server odoo.sql_db:253
bad query: INSERT INTO "purchase_order" ("id", "create_uid", "create_date", "write_uid", "write_date", "company_id", "currency_id", "date_order", "invoice_count", "invoice_status", "name", "partner_id", "picking_count", "picking_type_id", "state", "user_id") VALUES (nextval('purchase_order_id_seq'), 221, (now() at time zone 'UTC'), 221, (now() at time zone 'UTC'), 1, 1, '2021-04-06 20:14:35', 0, 'no', 'P00016', 9, 0, NULL, 'draft', 221) RETURNING id
ERROR: null value in column "picking_type_id" violates not-null constraint
DETAIL:  Failing row contains (19, null, null, P00016, null, null, 2021-04-06 20:14:35, null, 9, null, 1, draft, null, 0, no, null, null, null, null, null, null, null, 221, 1, null, 221, 2021-04-06 20:14:34.632209, 221, 2021-04-06 20:14:34.632209, 0, null, null).
2021-04-06 20:14:35 ERROR server odoo.addons.purchase_stock.tests.test_create_picking:84
ERROR: TestCreatePicking.test_01_check_double_validation
Traceback (most recent call last):
  File "/data/build/odoo/addons/purchase_stock/tests/test_create_picking.py", line 84, in test_01_check_double_validation
    self.po = self.env['purchase.order'].with_user(self.user_purchase_user).create(self.po_vals)
  File "<decorator-gen-262>", line 2, in create
  File "/data/build/odoo/odoo/api.py", line 314, in _model_create_single
    return create(self, arg)
  File "/data/build/odoo/addons/purchase/models/purchase.py", line 188, in create
    return super(PurchaseOrder, self.with_context(company_id=company_id)).create(vals)
  File "<decorator-gen-111>", line 2, in create
  File "/data/build/odoo/odoo/api.py", line 335, in _model_create_multi
    return create(self, [arg])
  File "/data/build/odoo/addons/mail/models/mail_thread.py", line 269, in create
    threads = super(MailThread, self).create(vals_list)
  File "<decorator-gen-3>", line 2, in create
  File "/data/build/odoo/odoo/api.py", line 336, in _model_create_multi
    return create(self, arg)
  File "/data/build/odoo/odoo/models.py", line 3810, in create
    records = self._create(data_list)
  File "/data/build/odoo/odoo/models.py", line 3916, in _create
    cr.execute(query, params)
  File "/data/build/odoo/odoo/sql_db.py", line 173, in wrapper
    return f(self, *args, **kwargs)
  File "/data/build/odoo/odoo/sql_db.py", line 250, in execute
    res = self._obj.execute(query, params)
psycopg2.IntegrityError: null value in column "picking_type_id" violates not-null constraint
DETAIL:  Failing row contains (19, null, null, P00016, null, null, 2021-04-06 20:14:35, null, 9, null, 1, draft, null, 0, no, null, null, null, null, null, null, null, 221, 1, null, 221, 2021-04-06 20:14:34.632209, 221, 2021-04-06 20:14:34.632209, 0, null, null).

2021-04-06 20:14:37 ERROR server odoo.modules.module:616 Module purchase_stock: 0 failures, 1 errors
2021-04-06 20:15:24 INFO server odoo.modules.module:613 odoo.addons.sale_stock.tests.test_anglo_saxon_valuation tested in 9.65s, 13913 queries
2021-04-06 20:15:26 INFO server odoo.modules.loading:279 95 modules loaded in 216.58s, 213210 queries
2021-04-06 20:15:31 INFO server odoo.modules.loading:279 101 modules loaded in 4.57s, 0 queries
2021-04-06 20:15:31 ERROR server odoo.modules.loading:528 At least one test failed when loading the modules.
2021-04-06 20:17:28 INFO server odoo.modules.module:613 odoo.addons.web.tests.test_js tested in 114.04s, 1927 queries
2021-04-06 20:17:36 INFO server odoo.modules.module:613 odoo.addons.product.tests.test_product_attribute_value_config tested in 7.51s, 13199 queries
2021-04-06 20:17:37 ERROR server odoo.addons.hr.tests.test_self_user_access:25
ERROR: TestSelfAccessProfile.test_access_my_profile
Traceback (most recent call last):
  File "/data/build/odoo/addons/hr/tests/test_self_user_access.py", line 25, in test_access_my_profile
    james.read(fields)
  File "/data/build/odoo/odoo/addons/base/models/res_users.py", line 1298, in read
    res = super(UsersView, self).read(other_fields, load=load)
  File "/data/build/odoo/odoo/addons/base/models/res_users.py", line 454, in read
    return super(Users, self).read(fields=fields, load=load)
  File "/data/build/odoo/odoo/models.py", line 2936, in read
    fields = self.check_field_access_rights('read', fields)
  File "/data/build/odoo/odoo/models.py", line 2918, in check_field_access_rights
    for f in sorted(invalid_fields)
odoo.exceptions.AccessError: ("The requested operation can not be completed due to security restrictions.\n\nDocument type: Users (res.users)\nOperation: read\nUser: 270\nFields:\n- address_home_id (allowed for groups 'Employees / Officer')\n- barcode (allowed for groups 'Employees / Officer')\n- birthday (allowed for groups 'Employees / Officer')\n- certificate (allowed for groups 'Employees / Officer')\n- children (allowed for groups 'Employees / Officer')\n- country_of_birth (allowed for groups 'Employees / Officer')\n- emergency_contact (allowed for groups 'Employees / Officer')\n- emergency_phone (allowed for groups 'Employees / Officer')\n- employee_bank_account_id (allowed for groups 'Employees / Officer')\n- employee_country_id (allowed for groups 'Employees / Officer')\n- employee_phone (allowed for groups 'Employees / Officer')\n- gender (allowed for groups 'Employees / Officer')\n- identification_id (allowed for groups 'Employees / Officer')\n- km_home_work (allowed for groups 'Employees / Officer')\n- marital (allowed for groups 'Employees / Officer')\n- passport_id (allowed for groups 'Employees / Officer')\n- permit_no (allowed for groups 'Employees / Officer')\n- pin (allowed for groups 'Employees / Officer')\n- place_of_birth (allowed for groups 'Employees / Officer')\n- spouse_birthdate (allowed for groups 'Employees / Officer')\n- spouse_complete_name (allowed for groups 'Employees / Officer')\n- study_field (allowed for groups 'Employees / Officer')\n- study_school (allowed for groups 'Employees / Officer')\n- visa_expire (allowed for groups 'Employees / Officer')\n- visa_no (allowed for groups 'Employees / Officer')", None)
2021-04-06 20:17:37 ERROR server odoo.modules.module:616 Module hr: 0 failures, 1 errors
2021-04-06 20:18:07 INFO server odoo.modules.module:613 odoo.addons.account.tests.test_account_move_in_invoice tested in 12.18s, 16992 queries
2021-04-06 20:18:15 INFO server odoo.modules.module:613 odoo.addons.account.tests.test_account_move_in_refund tested in 8.35s, 11790 queries
2021-04-06 20:18:32 INFO server odoo.modules.module:613 odoo.addons.account.tests.test_account_move_out_invoice tested in 16.82s, 23225 queries
2021-04-06 20:18:40 INFO server odoo.modules.module:613 odoo.addons.account.tests.test_account_move_out_refund tested in 7.86s, 11144 queries
2021-04-06 20:18:49 INFO server odoo.modules.module:613 odoo.addons.account.tests.test_account_onboarding tested in 6.87s, 1758 queries
2021-04-06 20:19:00 INFO server odoo.modules.module:613 odoo.addons.account.tests.test_invoice_taxes tested in 5.56s, 8056 queries
2021-04-06 20:19:10 INFO server odoo.modules.module:613 odoo.addons.account.tests.test_payment_term tested in 6.09s, 8028 queries
2021-04-06 20:19:28 INFO server odoo.modules.module:613 odoo.addons.account.tests.test_reconciliation tested in 14.67s, 23964 queries
2021-04-06 20:19:44 INFO server odoo.modules.module:613 odoo.addons.account.tests.test_reconciliation_widget tested in 13.27s, 3490 queries
2021-04-06 20:20:02 INFO server odoo.modules.module:613 odoo.addons.project.tests.test_project_ui tested in 11.41s, 1877 queries
2021-04-06 20:20:20 INFO server odoo.modules.module:613 odoo.addons.account_invoice_extract.tests.test_invoice_extract tested in 15.79s, 16867 queries
2021-04-06 20:20:23 ERROR server odoo.sql_db:253
bad query: INSERT INTO "purchase_order" ("id", "create_uid", "create_date", "write_uid", "write_date", "company_id", "currency_id", "date_order", "date_planned", "dest_address_id", "fiscal_position_id", "incoterm_id", "invoice_count", "invoice_status", "name", "notes", "origin", "partner_id", "partner_ref", "payment_term_id", "picking_count", "picking_type_id", "state", "user_id") VALUES (nextval('purchase_order_id_seq'), 354, (now() at time zone 'UTC'), 354, (now() at time zone 'UTC'), 1, 2, '2021-04-06 20:20:22', NULL, NULL, NULL, NULL, 0, 'no', 'P00066', NULL, NULL, 986, NULL, NULL, 0, NULL, 'draft', 354) RETURNING id
ERROR: null value in column "picking_type_id" violates not-null constraint
DETAIL:  Failing row contains (69, null, null, P00066, null, null, 2021-04-06 20:20:22, null, 986, null, 2, draft, null, 0, no, null, null, null, null, null, null, null, 354, 1, null, 354, 2021-04-06 20:20:22.52764, 354, 2021-04-06 20:20:22.52764, 0, null, null, null).
2021-04-06 20:20:23 ERROR server odoo.addons.purchase.tests.test_access_rights:66
ERROR: TestPurchaseInvoice.test_create_purchase_order
Traceback (most recent call last):
  File "/data/build/odoo/addons/purchase/tests/test_access_rights.py", line 66, in test_create_purchase_order
    purchase_order = purchase_order_form.save()
  File "/data/build/odoo/odoo/tests/common.py", line 1722, in save
    r = self._model.create(values)
  File "<decorator-gen-262>", line 2, in create
  File "/data/build/odoo/odoo/api.py", line 314, in _model_create_single
    return create(self, arg)
  File "/data/build/odoo/addons/purchase/models/purchase.py", line 188, in create
    return super(PurchaseOrder, self.with_context(company_id=company_id)).create(vals)
  File "<decorator-gen-111>", line 2, in create
  File "/data/build/odoo/odoo/api.py", line 335, in _model_create_multi
    return create(self, [arg])
  File "/data/build/odoo/addons/mail/models/mail_thread.py", line 269, in create
    threads = super(MailThread, self).create(vals_list)
  File "<decorator-gen-3>", line 2, in create
  File "/data/build/odoo/odoo/api.py", line 336, in _model_create_multi
    return create(self, arg)
  File "/data/build/odoo/odoo/models.py", line 3810, in create
    records = self._create(data_list)
  File "/data/build/odoo/odoo/models.py", line 3916, in _create
    cr.execute(query, params)
  File "/data/build/odoo/odoo/sql_db.py", line 173, in wrapper
    return f(self, *args, **kwargs)
  File "/data/build/odoo/odoo/sql_db.py", line 250, in execute
    res = self._obj.execute(query, params)
psycopg2.IntegrityError: null value in column "picking_type_id" violates not-null constraint
DETAIL:  Failing row contains (69, null, null, P00066, null, null, 2021-04-06 20:20:22, null, 986, null, 2, draft, null, 0, no, null, null, null, null, null, null, null, 354, 1, null, 354, 2021-04-06 20:20:22.52764, 354, 2021-04-06 20:20:22.52764, 0, null, null, null).

2021-04-06 20:20:23 ERROR server odoo.sql_db:253
bad query: INSERT INTO "purchase_order" ("id", "create_uid", "create_date", "write_uid", "write_date", "company_id", "currency_id", "date_order", "date_planned", "dest_address_id", "fiscal_position_id", "incoterm_id", "invoice_count", "invoice_status", "name", "notes", "origin", "partner_id", "partner_ref", "payment_term_id", "picking_count", "picking_type_id", "state", "user_id") VALUES (nextval('purchase_order_id_seq'), 355, (now() at time zone 'UTC'), 355, (now() at time zone 'UTC'), 1, 2, '2021-04-06 20:20:23', NULL, NULL, NULL, NULL, 0, 'no', 'P00067', NULL, NULL, 986, NULL, NULL, 0, NULL, 'draft', 355) RETURNING id
ERROR: null value in column "picking_type_id" violates not-null constraint
DETAIL:  Failing row contains (70, null, null, P00067, null, null, 2021-04-06 20:20:23, null, 986, null, 2, draft, null, 0, no, null, null, null, null, null, null, null, 355, 1, null, 355, 2021-04-06 20:20:22.52764, 355, 2021-04-06 20:20:22.52764, 0, null, null, null).
2021-04-06 20:20:23 ERROR server odoo.addons.purchase.tests.test_access_rights:93
ERROR: TestPurchaseInvoice.test_read_purchase_order
Traceback (most recent call last):
  File "/data/build/odoo/addons/purchase/tests/test_access_rights.py", line 93, in test_read_purchase_order
    purchase_order_user2 = purchase_order_form.save()
  File "/data/build/odoo/odoo/tests/common.py", line 1722, in save
    r = self._model.create(values)
  File "<decorator-gen-262>", line 2, in create
  File "/data/build/odoo/odoo/api.py", line 314, in _model_create_single
    return create(self, arg)
  File "/data/build/odoo/addons/purchase/models/purchase.py", line 188, in create
    return super(PurchaseOrder, self.with_context(company_id=company_id)).create(vals)
  File "<decorator-gen-111>", line 2, in create
  File "/data/build/odoo/odoo/api.py", line 335, in _model_create_multi
    return create(self, [arg])
  File "/data/build/odoo/addons/mail/models/mail_thread.py", line 269, in create
    threads = super(MailThread, self).create(vals_list)
  File "<decorator-gen-3>", line 2, in create
  File "/data/build/odoo/odoo/api.py", line 336, in _model_create_multi
    return create(self, arg)
  File "/data/build/odoo/odoo/models.py", line 3810, in create
    records = self._create(data_list)
  File "/data/build/odoo/odoo/models.py", line 3916, in _create
    cr.execute(query, params)
  File "/data/build/odoo/odoo/sql_db.py", line 173, in wrapper
    return f(self, *args, **kwargs)
  File "/data/build/odoo/odoo/sql_db.py", line 250, in execute
    res = self._obj.execute(query, params)
psycopg2.IntegrityError: null value in column "picking_type_id" violates not-null constraint
DETAIL:  Failing row contains (70, null, null, P00067, null, null, 2021-04-06 20:20:23, null, 986, null, 2, draft, null, 0, no, null, null, null, null, null, null, null, 355, 1, null, 355, 2021-04-06 20:20:22.52764, 355, 2021-04-06 20:20:22.52764, 0, null, null, null).

2021-04-06 20:20:23 ERROR server odoo.sql_db:253
bad query: INSERT INTO "purchase_order" ("id", "create_uid", "create_date", "write_uid", "write_date", "company_id", "currency_id", "date_order", "date_planned", "dest_address_id", "fiscal_position_id", "incoterm_id", "invoice_count", "invoice_status", "name", "notes", "origin", "partner_id", "partner_ref", "payment_term_id", "picking_count", "picking_type_id", "state", "user_id") VALUES (nextval('purchase_order_id_seq'), 356, (now() at time zone 'UTC'), 356, (now() at time zone 'UTC'), 1, 2, '2021-04-06 20:20:23', NULL, NULL, NULL, NULL, 0, 'no', 'P00068', NULL, NULL, 986, NULL, NULL, 0, NULL, 'draft', 356) RETURNING id
ERROR: null value in column "picking_type_id" violates not-null constraint
DETAIL:  Failing row contains (71, null, null, P00068, null, null, 2021-04-06 20:20:23, null, 986, null, 2, draft, null, 0, no, null, null, null, null, null, null, null, 356, 1, null, 356, 2021-04-06 20:20:22.52764, 356, 2021-04-06 20:20:22.52764, 0, null, null, null).
2021-04-06 20:20:23 ERROR server odoo.addons.purchase.tests.test_access_rights:128
ERROR: TestPurchaseInvoice.test_read_purchase_order_2
Traceback (most recent call last):
  File "/data/build/odoo/addons/purchase/tests/test_access_rights.py", line 128, in test_read_purchase_order_2
    purchase_order_user2 = purchase_order_form.save()
  File "/data/build/odoo/odoo/tests/common.py", line 1722, in save
    r = self._model.create(values)
  File "<decorator-gen-262>", line 2, in create
  File "/data/build/odoo/odoo/api.py", line 314, in _model_create_single
    return create(self, arg)
  File "/data/build/odoo/addons/purchase/models/purchase.py", line 188, in create
    return super(PurchaseOrder, self.with_context(company_id=company_id)).create(vals)
  File "<decorator-gen-111>", line 2, in create
  File "/data/build/odoo/odoo/api.py", line 335, in _model_create_multi
    return create(self, [arg])
  File "/data/build/odoo/addons/mail/models/mail_thread.py", line 269, in create
    threads = super(MailThread, self).create(vals_list)
  File "<decorator-gen-3>", line 2, in create
  File "/data/build/odoo/odoo/api.py", line 336, in _model_create_multi
    return create(self, arg)
  File "/data/build/odoo/odoo/models.py", line 3810, in create
    records = self._create(data_list)
  File "/data/build/odoo/odoo/models.py", line 3916, in _create
    cr.execute(query, params)
  File "/data/build/odoo/odoo/sql_db.py", line 173, in wrapper
    return f(self, *args, **kwargs)
  File "/data/build/odoo/odoo/sql_db.py", line 250, in execute
    res = self._obj.execute(query, params)
psycopg2.IntegrityError: null value in column "picking_type_id" violates not-null constraint
DETAIL:  Failing row contains (71, null, null, P00068, null, null, 2021-04-06 20:20:23, null, 986, null, 2, draft, null, 0, no, null, null, null, null, null, null, null, 356, 1, null, 356, 2021-04-06 20:20:22.52764, 356, 2021-04-06 20:20:22.52764, 0, null, null, null).

2021-04-06 20:20:23 ERROR server odoo.modules.module:616 Module purchase: 0 failures, 3 errors
2021-04-06 20:20:32 INFO server odoo.modules.module:613 odoo.addons.purchase_stock.tests.test_anglo_saxon_valuation_reconciliation tested in 5.43s, 7876 queries
2021-04-06 20:20:42 INFO server odoo.modules.module:613 odoo.addons.purchase_stock.tests.test_stockvaluation tested in 7.37s, 11268 queries
2021-04-06 20:20:43 ERROR server odoo.sql_db:253
bad query: INSERT INTO "sale_order" ("id", "create_uid", "create_date", "write_uid", "write_date", "company_id", "date_order", "name", "note", "partner_id", "partner_invoice_id", "partner_shipping_id", "picking_policy", "pricelist_id", "require_payment", "require_signature", "state", "team_id", "user_id", "validity_date", "warehouse_id") VALUES (nextval('sale_order_id_seq'), 367, (now() at time zone 'UTC'), 367, (now() at time zone 'UTC'), 1, '2021-04-06 20:20:43', 'S00079', '', 996, 996, 996, 'direct', 1, true, true, 'draft', 1, 369, NULL, NULL) RETURNING id
ERROR: null value in column "warehouse_id" violates not-null constraint
DETAIL:  Failing row contains (83, null, null, null, null, null, S00079, null, null, null, draft, 2021-04-06 20:20:43, null, t, t, 2021-04-06 20:20:42.573879, 369, 996, 996, 996, 1, null, null, , null, null, null, null, null, null, 1, 1, null, null, null, 367, 367, 2021-04-06 20:20:42.573879, null, direct, null, null, null, null).
2021-04-06 20:20:43 ERROR server odoo.addons.sale.tests.test_access_rights:71
ERROR: TestAccessRights.test_access_sales_manager
Traceback (most recent call last):
  File "/data/build/odoo/addons/sale/tests/test_access_rights.py", line 71, in test_access_sales_manager
    'user_id': self.user_salesperson_1.id
  File "<decorator-gen-272>", line 2, in create
  File "/data/build/odoo/odoo/api.py", line 314, in _model_create_single
    return create(self, arg)
  File "/data/build/odoo/addons/sale_stock/models/sale_order.py", line 67, in create
    return super(SaleOrder, self).create(vals)
  File "<decorator-gen-267>", line 2, in create
  File "/data/build/odoo/odoo/api.py", line 314, in _model_create_single
    return create(self, arg)
  File "/data/build/odoo/addons/sale/models/sale.py", line 463, in create
    result = super(SaleOrder, self).create(vals)
  File "<decorator-gen-111>", line 2, in create
  File "/data/build/odoo/odoo/api.py", line 335, in _model_create_multi
    return create(self, [arg])
  File "/data/build/odoo/addons/mail/models/mail_thread.py", line 259, in create
    return super(MailThread, self).create(vals_list)
  File "<decorator-gen-3>", line 2, in create
  File "/data/build/odoo/odoo/api.py", line 336, in _model_create_multi
    return create(self, arg)
  File "/data/build/odoo/odoo/models.py", line 3810, in create
    records = self._create(data_list)
  File "/data/build/odoo/odoo/models.py", line 3916, in _create
    cr.execute(query, params)
  File "/data/build/odoo/odoo/sql_db.py", line 173, in wrapper
    return f(self, *args, **kwargs)
  File "/data/build/odoo/odoo/sql_db.py", line 250, in execute
    res = self._obj.execute(query, params)
psycopg2.IntegrityError: null value in column "warehouse_id" violates not-null constraint
DETAIL:  Failing row contains (83, null, null, null, null, null, S00079, null, null, null, draft, 2021-04-06 20:20:43, null, t, t, 2021-04-06 20:20:42.573879, 369, 996, 996, 996, 1, null, null, , null, null, null, null, null, null, 1, 1, null, null, null, 367, 367, 2021-04-06 20:20:42.573879, null, direct, null, null, null, null).

2021-04-06 20:20:43 ERROR server odoo.sql_db:253
bad query: INSERT INTO "sale_order" ("id", "create_uid", "create_date", "write_uid", "write_date", "company_id", "date_order", "name", "note", "partner_id", "partner_invoice_id", "partner_shipping_id", "picking_policy", "pricelist_id", "require_payment", "require_signature", "state", "team_id", "user_id", "validity_date", "warehouse_id") VALUES (nextval('sale_order_id_seq'), 374, (now() at time zone 'UTC'), 374, (now() at time zone 'UTC'), 1, '2021-04-06 20:20:43', 'S00081', '', 996, 996, 996, 'direct', 1, true, true, 'draft', 1, 373, NULL, NULL) RETURNING id
ERROR: null value in column "warehouse_id" violates not-null constraint
DETAIL:  Failing row contains (85, null, null, null, null, null, S00081, null, null, null, draft, 2021-04-06 20:20:43, null, t, t, 2021-04-06 20:20:42.573879, 373, 996, 996, 996, 1, null, null, , null, null, null, null, null, null, 1, 1, null, null, null, 374, 374, 2021-04-06 20:20:42.573879, null, direct, null, null, null, null).
2021-04-06 20:20:43 ERROR server odoo.addons.sale.tests.test_access_rights:109
ERROR: TestAccessRights.test_access_sales_person
Traceback (most recent call last):
  File "/data/build/odoo/addons/sale/tests/test_access_rights.py", line 109, in test_access_sales_person
    'user_id': self.user_salesperson.id
  File "<decorator-gen-272>", line 2, in create
  File "/data/build/odoo/odoo/api.py", line 314, in _model_create_single
    return create(self, arg)
  File "/data/build/odoo/addons/sale_stock/models/sale_order.py", line 67, in create
    return super(SaleOrder, self).create(vals)
  File "<decorator-gen-267>", line 2, in create
  File "/data/build/odoo/odoo/api.py", line 314, in _model_create_single
    return create(self, arg)
  File "/data/build/odoo/addons/sale/models/sale.py", line 463, in create
    result = super(SaleOrder, self).create(vals)
  File "<decorator-gen-111>", line 2, in create
  File "/data/build/odoo/odoo/api.py", line 335, in _model_create_multi
    return create(self, [arg])
  File "/data/build/odoo/addons/mail/models/mail_thread.py", line 269, in create
    threads = super(MailThread, self).create(vals_list)
  File "<decorator-gen-3>", line 2, in create
  File "/data/build/odoo/odoo/api.py", line 336, in _model_create_multi
    return create(self, arg)
  File "/data/build/odoo/odoo/models.py", line 3810, in create
    records = self._create(data_list)
  File "/data/build/odoo/odoo/models.py", line 3916, in _create
    cr.execute(query, params)
  File "/data/build/odoo/odoo/sql_db.py", line 173, in wrapper
    return f(self, *args, **kwargs)
  File "/data/build/odoo/odoo/sql_db.py", line 250, in execute
    res = self._obj.execute(query, params)
psycopg2.IntegrityError: null value in column "warehouse_id" violates not-null constraint
DETAIL:  Failing row contains (85, null, null, null, null, null, S00081, null, null, null, draft, 2021-04-06 20:20:43, null, t, t, 2021-04-06 20:20:42.573879, 373, 996, 996, 996, 1, null, null, , null, null, null, null, null, null, 1, 1, null, null, null, 374, 374, 2021-04-06 20:20:42.573879, null, direct, null, null, null, null).

2021-04-06 20:20:43 ERROR server odoo.modules.module:616 Module sale: 0 failures, 2 errors
2021-04-06 20:20:48 INFO server odoo.modules.module:613 odoo.addons.sale.tests.test_sale_product_attribute_value_config tested in 5.52s, 9543 queries
2021-04-06 20:21:06 INFO server odoo.modules.module:613 odoo.addons.sale_stock.tests.test_sale_stock tested in 7.96s, 12395 queries
2021-04-06 20:21:22 INFO runbot Getting results for build 01597-13-0
2021-04-06 20:21:22 Step all finished in 10m
2021-04-06 20:21:22 Starting step setup from config Adhoc Conf
2021-04-06 20:21:22 INFO runbot Using Dockerfile Tag odoo:DockerDefaultadhocv13
2021-04-06 20:22:29 ERROR runbot Docker with state UNKNOWN not started after 60 seconds, skipping
2021-04-06 20:22:29 INFO runbot Step setup finished in 67s
2021-04-06 20:22:29 Starting step run from config Adhoc Conf
2021-04-06 20:22:29 INFO runbot Start running build 01597-13-0
2021-04-06 20:22:29 INFO runbot Using Dockerfile Tag odoo:DockerDefaultadhocv13
2021-04-06 20:22:50 INFO server odoo.modules.loading:279 1 modules loaded in 0.01s, 0 queries
2021-04-06 20:22:53 INFO server odoo.modules.loading:279 101 modules loaded in 0.84s, 0 queries
2021-04-08 12:14:12 INFO runbot Killing build 01597-13-0, requested by Administrator (user #2)
2021-04-08 12:14:16 INFO runbot Kill build 01597-13-0
2021-04-08 13:56:51 Waking up build
2021-04-08 13:56:51 INFO runbot Start running build 01597-13-0
2021-04-08 13:56:51 INFO runbot Using Dockerfile Tag odoo:DockerDefaultadhocv13
2021-04-08 13:57:12 INFO server odoo.modules.loading:279 1 modules loaded in 0.01s, 0 queries
2021-04-08 13:57:16 INFO server odoo.modules.loading:279 101 modules loaded in 0.87s, 0 queries
2021-04-08 13:58:01 INFO server odoo.modules.loading:279 1 modules loaded in 0.01s, 0 queries
2021-04-08 13:58:05 INFO server odoo.modules.loading:279 101 modules loaded in 0.94s, 0 queries
2021-04-09 20:14:23 WARNING server odoo.addons.digest.models.digest:203 MailDeliveryException while sending digest %d. Digest is now scheduled for next cron update.
2021-04-10 12:41:21 INFO server odoo.modules.loading:279 1 modules loaded in 0.01s, 0 queries
2021-04-10 12:41:21 INFO server odoo.modules.loading:279 11 modules loaded in 0.03s, 0 queries
2021-04-10 17:51:14 INFO runbot Kill build 01597-13-0