Commit: ingadhoc/purchase:9de41d16
Subject: [IMP] adapt to new runbot
Author: Juan Jose Scarafia
Committer: Juan Jose Scarafia
Commit: False:3c0f74db
Subject: [IMP] use new runbot
Author: Juan Jose Scarafia
Committer: Juan Jose Scarafia
Commit: False:eab4369f
Subject: [13.0] [IMP] account_ux: Use the rate value to show amounts in the reconcilation info.
Author: Nicolás Mac Rouillon
Committer: Juan José Scarafía
Commit: ingadhoc/stock:b8fd888a
Subject: [IMP] adapt to new runbot
Author: Juan Jose Scarafia
Committer: Juan Jose Scarafia
Commit: odoo:dff91809
Subject: [FIX] web: multiedit in a grouped list view: enable fetchBatchedM2O and References
Author: Lucas Perais (lpe)
Committer: Lucas Perais (lpe)
Commit: enterprise:97e12fb5
Subject: [FIX] l10n_mx_edi: fix installation error
Author: Ivan Yelizariev
Committer: Ivan Yelizariev
Commit: oca/social:fad96215
Subject: [UPD] addons table in README.md
Author: OCA-git-bot
Committer: OCA-git-bot
Commit: False:0d066eea
Subject: web_responsive 13.0.2.6.2
Author: OCA-git-bot
Committer: OCA-git-bot
Commit: oca/purchase-workflow:4c9a5b24
Subject: purchase_delivery_split_date 13.0.1.0.1
Author: OCA-git-bot
Committer: OCA-git-bot
Commit: oca/stock-logistics-workflow:900ac9fb
Subject: stock_quant_package_dimension 13.0.1.1.0
Author: OCA-git-bot
Committer: OCA-git-bot
Commit: oca/stock-logistics-warehouse:db4b0c21
Subject: stock_helper 13.0.1.1.0
Author: OCA-git-bot
Committer: OCA-git-bot
Commit: False:a05e74a4
Subject: OCA Transbot updated translations from Transifex
Author: ADHOC - Transbot
Committer: ADHOC - Transbot
Commit: ingadhoc/aeroo_reports:4f388ca5
Subject: [FIX] aeroo readme
Author: Juan Jose Scarafia
Committer: Juan Jose Scarafia
Version: 13.0
Config: Adhoc Conf
Total time: 18m

Date Level Type Message
2021-02-15 11:12:11 INFO runbot Init build environment with config Adhoc Conf
2021-02-15 11:12:11 Starting step base from config Adhoc Conf
2021-02-15 11:12:45 INFO server odoo.modules.loading:279 1 modules loaded in 6.16s, 0 queries
2021-02-15 11:12:52 INFO server odoo.modules.loading:279 11 modules loaded in 5.26s, 0 queries
2021-02-15 11:12:55 Step base finished in 43s
2021-02-15 11:12:55 Starting step all from config Adhoc Conf
2021-02-15 11:13:49 INFO server odoo.modules.module:613 odoo.addons.base.tests.test_translate tested in 8.39s, 952 queries
2021-02-15 11:13:53 INFO server odoo.modules.loading:279 1 modules loaded in 31.52s, 20556 queries
2021-02-15 11:14:29 INFO server odoo.modules.module:613 odoo.addons.product.tests.test_variants tested in 6.82s, 15670 queries
2021-02-15 11:14:57 INFO server odoo.modules.module:613 odoo.addons.stock.tests.test_move tested in 6.63s, 13015 queries
2021-02-15 11:15:06 INFO server odoo.modules.module:613 odoo.addons.stock.tests.test_move2 tested in 9.40s, 18531 queries
2021-02-15 11:15:19 INFO server odoo.modules.module:613 odoo.addons.stock.tests.test_stock_flow tested in 7.38s, 13783 queries
2021-02-15 11:15:45 INFO server odoo.modules.module:613 odoo.addons.mrp.tests.test_multicompany tested in 6.30s, 13521 queries
2021-02-15 11:16:03 INFO server odoo.modules.module:613 odoo.addons.mrp.tests.test_order tested in 16.96s, 28028 queries
2021-02-15 11:16:13 INFO server odoo.modules.module:613 odoo.addons.mrp.tests.test_stock tested in 7.01s, 12748 queries
2021-02-15 11:16:15 ERROR server odoo.addons.mrp.tests.test_traceability:113
FAIL: TestTraceability.test_tracking_types_on_mo
Traceback (most recent call last):
  File "/data/build/odoo/addons/mrp/tests/test_traceability.py", line 113, in test_tracking_types_on_mo
    'Parts with tracking type "%s", should have be unfoldable : %s' % (tracking, unfoldable)
AssertionError: False != True : Parts with tracking type "Product", should have be unfoldable : True
2021-02-15 11:16:15 ERROR server odoo.modules.module:616 Module mrp: 1 failures, 0 errors
2021-02-15 11:16:22 INFO server odoo.modules.module:613 odoo.addons.mrp.tests.test_unbuild tested in 6.79s, 11928 queries
2021-02-15 11:16:30 INFO server odoo.modules.module:613 odoo.addons.mrp.tests.test_warehouse_multistep_manufacturing tested in 7.70s, 14858 queries
2021-02-15 11:16:48 INFO server odoo.modules.module:613 odoo.addons.mrp.tests.test_workorder_operation tested in 18.42s, 28024 queries
2021-02-15 11:17:07 INFO server odoo.modules.module:613 odoo.addons.stock_request.tests.test_stock_request tested in 11.50s, 23716 queries
2021-02-15 11:18:11 INFO server odoo.modules.module:613 odoo.addons.stock_account.tests.test_stockvaluation tested in 9.06s, 14128 queries
2021-02-15 11:18:24 INFO server odoo.modules.module:613 odoo.addons.stock_account.tests.test_stockvaluationlayer tested in 13.39s, 22185 queries
2021-02-15 11:18:46 INFO server odoo.modules.module:613 odoo.addons.mrp_account.tests.test_valuation_layers tested in 9.45s, 14097 queries
2021-02-15 11:19:40 ERROR server odoo.addons.purchase_discount.tests.test_product_supplierinfo_discount:104
ERROR: TestProductSupplierinfoDiscount.test_004_prepare_purchase_order_line
Traceback (most recent call last):
  File "/data/build/oca/purchase-workflow/purchase_discount/tests/test_product_supplierinfo_discount.py", line 104, in test_004_prepare_purchase_order_line
    self.purchase_order,
  File "/data/build/oca/purchase-workflow/purchase_discount/models/stock_rule.py", line 14, in _prepare_purchase_order_line
    product_id, product_qty, product_uom, company_id, values, po
  File "/data/build/ingadhoc/product/product_uoms_purchase/models/stock_rule.py", line 21, in _prepare_purchase_order_line
    product_uom=product_uom, values=values, po=po, supplier=supplier)
TypeError: _prepare_purchase_order_line() got an unexpected keyword argument 'supplier'
2021-02-15 11:19:40 ERROR server odoo.modules.module:616 Module purchase_discount: 0 failures, 1 errors
2021-02-15 11:19:40 ERROR server odoo.addons.purchase_discount.tests.test_purchase_discount:162
ERROR: TestPurchaseOrder.test_invoice
Traceback (most recent call last):
  File "/data/build/odoo/odoo/api.py", line 745, in get
    value = self._data[field][record._ids[0]]
KeyError: <NewId 0x7f082b8cf320>

During handling of the above exception, another exception occurred:

Traceback (most recent call last):
  File "/data/build/odoo/odoo/fields.py", line 1037, in __get__
    value = env.cache.get(record, self)
  File "/data/build/odoo/odoo/api.py", line 751, in get
    raise CacheMiss(record, field)
odoo.exceptions.CacheMiss: ('account.move(<NewId 0x7f082b8cf320>,).journal_id', None)

During handling of the above exception, another exception occurred:

Traceback (most recent call last):
  File "/data/build/oca/purchase-workflow/purchase_discount/tests/test_purchase_discount.py", line 162, in test_invoice
    invoice._onchange_purchase_auto_complete()
  File "/data/build/odoo/addons/purchase/models/account_invoice.py", line 58, in _onchange_purchase_auto_complete
    new_line.account_id = new_line._get_computed_account()
  File "/data/build/odoo/addons/stock_account/models/account_move.py", line 235, in _get_computed_account
    return super(AccountMoveLine, self)._get_computed_account()
  File "/data/build/odoo/addons/account/models/account_move.py", line 2777, in _get_computed_account
    self = self.with_context(force_company=self.move_id.journal_id.company_id.id)
  File "/data/build/odoo/odoo/fields.py", line 2366, in __get__
    return super().__get__(records, owner)
  File "/data/build/odoo/odoo/fields.py", line 1079, in __get__
    defaults = record.default_get([self.name])
  File "/data/build/odoo/addons/utm/models/utm_mixin.py", line 22, in default_get
    values = super(UtmMixin, self).default_get(fields)
  File "/data/build/odoo/odoo/models.py", line 1244, in default_get
    defaults[name] = field.default(self)
  File "/data/build/odoo/addons/account/models/account_move.py", line 75, in _get_default_journal
    raise UserError(error_msg)
odoo.exceptions.UserError: ('Please define an accounting miscellaneous journal in your company', '')
2021-02-15 11:19:41 ERROR server odoo.modules.module:616 Module purchase_discount: 0 failures, 1 errors
2021-02-15 11:19:47 INFO server odoo.modules.module:613 odoo.addons.purchase_mrp.tests.test_purchase_mrp_flow tested in 5.89s, 7988 queries
2021-02-15 11:19:51 ERROR server odoo.addons.sale_purchase.tests.test_access_rights:62
FAIL: TestAccessRights.test_access_saleperson
Traceback (most recent call last):
  File "/data/build/odoo/addons/sale_purchase/tests/test_access_rights.py", line 62, in test_access_saleperson
    purchase_orders.read()
  File "/usr/lib/python3.6/contextlib.py", line 88, in __exit__
    next(self.gen)
  File "/data/build/odoo/odoo/tests/common.py", line 256, in _assertRaises
    yield cm
AssertionError: AccessError not raised
2021-02-15 11:19:51 ERROR server odoo.modules.module:616 Module sale_purchase: 1 failures, 0 errors
2021-02-15 11:20:04 INFO server odoo.modules.module:613 odoo.addons.sale_stock.tests.test_anglo_saxon_valuation tested in 10.09s, 14825 queries
2021-02-15 11:20:07 ERROR server odoo.addons.stock_request_purchase.tests.test_stock_request_purchase:115
ERROR: TestStockRequestPurchase.test_create_request_01
Traceback (most recent call last):
  File "/data/build/oca/stock-logistics-warehouse/stock_request_purchase/tests/test_stock_request_purchase.py", line 115, in test_create_request_01
    order.action_confirm()
  File "/data/build/oca/stock-logistics-warehouse/stock_request/models/stock_request_order.py", line 227, in action_confirm
    line.action_confirm()
  File "/data/build/oca/stock-logistics-warehouse/stock_request/models/stock_request.py", line 214, in action_confirm
    self._action_confirm()
  File "/data/build/oca/stock-logistics-warehouse/stock_request/models/stock_request.py", line 210, in _action_confirm
    self._action_launch_procurement_rule()
  File "/data/build/oca/stock-logistics-warehouse/stock_request/models/stock_request.py", line 309, in _action_launch_procurement_rule
    self.env["procurement.group"].run(procurements)
  File "/data/build/oca/stock-logistics-warehouse/stock_request/models/procurement_group.py", line 29, in run
    return super().run(procurements)
  File "/data/build/odoo/addons/mrp/models/stock_rule.py", line 176, in run
    return super(ProcurementGroup, self).run(procurements_without_kit)
  File "/data/build/odoo/addons/stock/models/stock_rule.py", line 394, in run
    getattr(self.env['stock.rule'], '_run_%s' % action)(procurements)
  File "/data/build/odoo/addons/purchase_stock/models/stock_rule.py", line 125, in _run_buy
    procurement.values, po))
  File "/data/build/oca/stock-logistics-warehouse/stock_request_purchase/models/stock_rule.py", line 14, in _prepare_purchase_order_line
    product_id, product_qty, product_uom, company_id, values, po
  File "/data/build/oca/purchase-workflow/purchase_discount/models/stock_rule.py", line 14, in _prepare_purchase_order_line
    product_id, product_qty, product_uom, company_id, values, po
  File "/data/build/ingadhoc/product/product_uoms_purchase/models/stock_rule.py", line 21, in _prepare_purchase_order_line
    product_uom=product_uom, values=values, po=po, supplier=supplier)
TypeError: _prepare_purchase_order_line() got an unexpected keyword argument 'supplier'
2021-02-15 11:20:08 ERROR server odoo.addons.stock_request_purchase.tests.test_stock_request_purchase:168
ERROR: TestStockRequestPurchase.test_create_request_02
Traceback (most recent call last):
  File "/data/build/oca/stock-logistics-warehouse/stock_request_purchase/tests/test_stock_request_purchase.py", line 168, in test_create_request_02
    stock_request_1.action_confirm()
  File "/data/build/oca/stock-logistics-warehouse/stock_request/models/stock_request.py", line 214, in action_confirm
    self._action_confirm()
  File "/data/build/oca/stock-logistics-warehouse/stock_request/models/stock_request.py", line 210, in _action_confirm
    self._action_launch_procurement_rule()
  File "/data/build/oca/stock-logistics-warehouse/stock_request/models/stock_request.py", line 309, in _action_launch_procurement_rule
    self.env["procurement.group"].run(procurements)
  File "/data/build/oca/stock-logistics-warehouse/stock_request/models/procurement_group.py", line 29, in run
    return super().run(procurements)
  File "/data/build/odoo/addons/mrp/models/stock_rule.py", line 176, in run
    return super(ProcurementGroup, self).run(procurements_without_kit)
  File "/data/build/odoo/addons/stock/models/stock_rule.py", line 394, in run
    getattr(self.env['stock.rule'], '_run_%s' % action)(procurements)
  File "/data/build/odoo/addons/purchase_stock/models/stock_rule.py", line 125, in _run_buy
    procurement.values, po))
  File "/data/build/oca/stock-logistics-warehouse/stock_request_purchase/models/stock_rule.py", line 14, in _prepare_purchase_order_line
    product_id, product_qty, product_uom, company_id, values, po
  File "/data/build/oca/purchase-workflow/purchase_discount/models/stock_rule.py", line 14, in _prepare_purchase_order_line
    product_id, product_qty, product_uom, company_id, values, po
  File "/data/build/ingadhoc/product/product_uoms_purchase/models/stock_rule.py", line 21, in _prepare_purchase_order_line
    product_uom=product_uom, values=values, po=po, supplier=supplier)
TypeError: _prepare_purchase_order_line() got an unexpected keyword argument 'supplier'
2021-02-15 11:20:09 ERROR server odoo.addons.stock_request_purchase.tests.test_stock_request_purchase:242
ERROR: TestStockRequestPurchase.test_view_actions
Traceback (most recent call last):
  File "/data/build/oca/stock-logistics-warehouse/stock_request_purchase/tests/test_stock_request_purchase.py", line 242, in test_view_actions
    order.action_confirm()
  File "/data/build/oca/stock-logistics-warehouse/stock_request/models/stock_request_order.py", line 227, in action_confirm
    line.action_confirm()
  File "/data/build/oca/stock-logistics-warehouse/stock_request/models/stock_request.py", line 214, in action_confirm
    self._action_confirm()
  File "/data/build/oca/stock-logistics-warehouse/stock_request/models/stock_request.py", line 210, in _action_confirm
    self._action_launch_procurement_rule()
  File "/data/build/oca/stock-logistics-warehouse/stock_request/models/stock_request.py", line 309, in _action_launch_procurement_rule
    self.env["procurement.group"].run(procurements)
  File "/data/build/oca/stock-logistics-warehouse/stock_request/models/procurement_group.py", line 29, in run
    return super().run(procurements)
  File "/data/build/odoo/addons/mrp/models/stock_rule.py", line 176, in run
    return super(ProcurementGroup, self).run(procurements_without_kit)
  File "/data/build/odoo/addons/stock/models/stock_rule.py", line 394, in run
    getattr(self.env['stock.rule'], '_run_%s' % action)(procurements)
  File "/data/build/odoo/addons/purchase_stock/models/stock_rule.py", line 125, in _run_buy
    procurement.values, po))
  File "/data/build/oca/stock-logistics-warehouse/stock_request_purchase/models/stock_rule.py", line 14, in _prepare_purchase_order_line
    product_id, product_qty, product_uom, company_id, values, po
  File "/data/build/oca/purchase-workflow/purchase_discount/models/stock_rule.py", line 14, in _prepare_purchase_order_line
    product_id, product_qty, product_uom, company_id, values, po
  File "/data/build/ingadhoc/product/product_uoms_purchase/models/stock_rule.py", line 21, in _prepare_purchase_order_line
    product_uom=product_uom, values=values, po=po, supplier=supplier)
TypeError: _prepare_purchase_order_line() got an unexpected keyword argument 'supplier'
2021-02-15 11:20:09 ERROR server odoo.modules.module:616 Module stock_request_purchase: 0 failures, 3 errors
2021-02-15 11:20:25 INFO server odoo.modules.module:613 odoo.addons.delivery.tests.test_packing_delivery tested in 8.89s, 13351 queries
2021-02-15 11:20:42 ERROR server odoo.addons.sale_mrp.tests.test_sale_mrp_lead_time:104
ERROR: TestSaleMrpLeadTime.test_01_product_route_level_delays
Traceback (most recent call last):
  File "/data/build/odoo/addons/sale_mrp/tests/test_sale_mrp_lead_time.py", line 104, in test_01_product_route_level_delays
    self.env['procurement.group'].run_scheduler()
  File "/data/build/odoo/addons/stock/models/stock_rule.py", line 502, in run_scheduler
    self._run_scheduler_tasks(use_new_cursor=use_new_cursor, company_id=company_id)
  File "/data/build/odoo/addons/product_expiry/models/production_lot.py", line 95, in _run_scheduler_tasks
    super(ProcurementGroup, self)._run_scheduler_tasks(use_new_cursor=use_new_cursor, company_id=company_id)
  File "/data/build/odoo/addons/stock/models/stock_rule.py", line 474, in _run_scheduler_tasks
    self.sudo()._procure_orderpoint_confirm(use_new_cursor=use_new_cursor, company_id=company_id)
  File "/data/build/odoo/addons/stock/models/stock_rule.py", line 615, in _procure_orderpoint_confirm
    orderpoint.company_id, values)])
  File "/data/build/oca/stock-logistics-warehouse/stock_request/models/procurement_group.py", line 29, in run
    return super().run(procurements)
  File "/data/build/odoo/addons/mrp/models/stock_rule.py", line 176, in run
    return super(ProcurementGroup, self).run(procurements_without_kit)
  File "/data/build/odoo/addons/stock/models/stock_rule.py", line 394, in run
    getattr(self.env['stock.rule'], '_run_%s' % action)(procurements)
  File "/data/build/odoo/addons/purchase_stock/models/stock_rule.py", line 125, in _run_buy
    procurement.values, po))
  File "/data/build/oca/stock-logistics-warehouse/stock_request_purchase/models/stock_rule.py", line 14, in _prepare_purchase_order_line
    product_id, product_qty, product_uom, company_id, values, po
  File "/data/build/oca/purchase-workflow/purchase_discount/models/stock_rule.py", line 14, in _prepare_purchase_order_line
    product_id, product_qty, product_uom, company_id, values, po
  File "/data/build/ingadhoc/product/product_uoms_purchase/models/stock_rule.py", line 21, in _prepare_purchase_order_line
    product_uom=product_uom, values=values, po=po, supplier=supplier)
TypeError: _prepare_purchase_order_line() got an unexpected keyword argument 'supplier'
2021-02-15 11:20:42 ERROR server odoo.modules.module:616 Module sale_mrp: 0 failures, 1 errors
2021-02-15 11:20:43 ERROR server odoo.addons.sale_mrp.tests.test_sale_mrp_procurement:32
FAIL: TestSaleMrpProcurement.test_sale_mrp
Traceback (most recent call last):
  File "/data/build/odoo/addons/sale_mrp/tests/test_sale_mrp_procurement.py", line 32, in test_sale_mrp
    product.list_price = 200.0
  File "/data/build/odoo/odoo/tests/common.py", line 1686, in __setattr__
    "can't write on readonly field {}".format(field)
AssertionError: can't write on readonly field list_price
2021-02-15 11:20:45 ERROR server odoo.modules.module:616 Module sale_mrp: 1 failures, 0 errors
2021-02-15 11:21:02 INFO server odoo.modules.loading:279 165 modules loaded in 426.75s, 458307 queries
2021-02-15 11:21:04 INFO server odoo.modules.loading:279 167 modules loaded in 1.67s, 0 queries
2021-02-15 11:21:04 ERROR server odoo.modules.loading:528 At least one test failed when loading the modules.
2021-02-15 11:21:05 ERROR server odoo.addons.base.tests.test_form_create:15
FAIL: TestFormCreate.test_create_res_partner
Traceback (most recent call last):
  File "/data/build/odoo/odoo/addons/base/tests/test_form_create.py", line 15, in test_create_res_partner
    partner_form.save()
  File "/data/build/odoo/odoo/tests/common.py", line 1716, in save
    values = self._values_to_save()
  File "/data/build/odoo/odoo/tests/common.py", line 1745, in _values_to_save
    changed, all_fields
  File "/data/build/odoo/odoo/tests/common.py", line 1778, in _values_to_save_
    raise AssertionError("{} is a required field ({})".format(f, view['modifiers'][f]))
AssertionError: property_account_payable_id is a required field ({'required': True})
2021-02-15 11:21:05 ERROR server odoo.modules.module:616 Module base: 1 failures, 0 errors
2021-02-15 11:23:02 INFO server odoo.addons.web.tests.test_js.WebSuite:862 Screenshot in: /data/build/tests/00054-13-0-all/screenshots/sc_20210215_112302_615128_WebSuite.png
2021-02-15 11:23:02 ERROR server odoo.addons.web.tests.test_js:15
FAIL: WebSuite.test_js
Traceback (most recent call last):
  File "/data/build/odoo/addons/web/tests/test_js.py", line 15, in test_js
    self.phantom_js('/web/tests?mod=web&failfast', "", "", login='admin', timeout=1800)
  File "/data/build/odoo/odoo/tests/common.py", line 1244, in browser_js
    self.fail('%s\n%s' % (message, error))
AssertionError: Some js test failed
"QUnit test failed: "account_invoice_extract > FormView > basic" [message: "should display 5 invoice extract buttons", actual: "6", expected: "5"]
1 / 12097 tests failed.
2021-02-15 11:23:02 INFO server odoo.modules.module:613 odoo.addons.web.tests.test_js tested in 114.88s, 2356 queries
2021-02-15 11:23:02 ERROR server odoo.modules.module:616 Module web: 1 failures, 0 errors
2021-02-15 11:23:14 INFO server odoo.modules.module:613 odoo.addons.product.tests.test_product_attribute_value_config tested in 11.32s, 21034 queries
2021-02-15 11:23:19 ERROR server odoo.addons.stock.tests.test_packing:758
ERROR: TestPacking.test_entire_pack_overship
Traceback (most recent call last):
  File "/data/build/odoo/addons/stock/tests/test_packing.py", line 758, in test_entire_pack_overship
    package_level.is_done = True
  File "/data/build/odoo/odoo/tests/common.py", line 1703, in __exit__
    self.save()
  File "/data/build/odoo/odoo/tests/common.py", line 1720, in save
    r.write(values)
  File "/data/build/odoo/addons/stock/models/stock_picking.py", line 603, in write
    res = super(Picking, self).write(vals)
  File "/data/build/odoo/addons/mail/models/mail_thread.py", line 323, in write
    result = super(MailThread, self).write(values)
  File "/data/build/odoo/addons/mail/models/mail_activity.py", line 726, in write
    return super(MailActivityMixin, self).write(vals)
  File "/data/build/odoo/odoo/models.py", line 3610, in write
    field.write(self, vals[fname])
  File "/data/build/odoo/odoo/fields.py", line 2899, in write
    return self.write_batch([(records, value)])
  File "/data/build/odoo/odoo/fields.py", line 2920, in write_batch
    return self.write_real(records_commands_list, create)
  File "/data/build/odoo/odoo/fields.py", line 3072, in write_real
    comodel.browse(command[1]).write(command[2])
  File "/data/build/odoo/addons/stock/models/stock_package_level.py", line 152, in write
    result = super(StockPackageLevel, self).write(vals)
  File "/data/build/odoo/odoo/models.py", line 3637, in write
    fields[0].determine_inverse(real_recs)
  File "/data/build/odoo/odoo/fields.py", line 1155, in determine_inverse
    getattr(records, self.inverse)()
  File "/data/build/odoo/addons/stock/models/stock_package_level.py", line 73, in _set_is_done
    'owner_id': quant.owner_id.id,
  File "<decorator-gen-280>", line 2, in create
  File "/data/build/odoo/odoo/api.py", line 335, in _model_create_multi
    return create(self, [arg])
  File "/data/build/odoo/addons/stock_account/models/stock_move_line.py", line 16, in create
    move_lines = super(StockMoveLine, self).create(vals_list)
  File "<decorator-gen-228>", line 2, in create
  File "/data/build/odoo/odoo/api.py", line 336, in _model_create_multi
    return create(self, arg)
  File "/data/build/odoo/addons/stock/models/stock_move_line.py", line 211, in create
    mls = super(StockMoveLine, self).create(vals_list)
  File "<decorator-gen-3>", line 2, in create
  File "/data/build/odoo/odoo/api.py", line 336, in _model_create_multi
    return create(self, arg)
  File "/data/build/odoo/odoo/models.py", line 3810, in create
    records = self._create(data_list)
  File "/data/build/odoo/odoo/models.py", line 3983, in _create
    records._validate_fields(name for data in data_list for name in data['stored'])
  File "/data/build/odoo/odoo/models.py", line 1206, in _validate_fields
    check(self)
  File "/data/build/ingadhoc/stock/stock_ux/models/stock_move_line.py", line 91, in _check_quantity
    _('You can not transfer more than the initial demand!'))
odoo.exceptions.ValidationError: ('You can not transfer more than the initial demand!', None)
2021-02-15 11:23:20 ERROR server odoo.addons.stock.tests.test_packing:346
ERROR: TestPacking.test_move_picking_with_package_2
Traceback (most recent call last):
  File "/data/build/odoo/addons/stock/tests/test_packing.py", line 346, in test_move_picking_with_package_2
    'result_package_id': package.id,
  File "<decorator-gen-280>", line 2, in create
  File "/data/build/odoo/odoo/api.py", line 335, in _model_create_multi
    return create(self, [arg])
  File "/data/build/odoo/addons/stock_account/models/stock_move_line.py", line 16, in create
    move_lines = super(StockMoveLine, self).create(vals_list)
  File "<decorator-gen-228>", line 2, in create
  File "/data/build/odoo/odoo/api.py", line 336, in _model_create_multi
    return create(self, arg)
  File "/data/build/odoo/addons/stock/models/stock_move_line.py", line 211, in create
    mls = super(StockMoveLine, self).create(vals_list)
  File "<decorator-gen-3>", line 2, in create
  File "/data/build/odoo/odoo/api.py", line 336, in _model_create_multi
    return create(self, arg)
  File "/data/build/odoo/odoo/models.py", line 3810, in create
    records = self._create(data_list)
  File "/data/build/odoo/odoo/models.py", line 3983, in _create
    records._validate_fields(name for data in data_list for name in data['stored'])
  File "/data/build/odoo/odoo/models.py", line 1206, in _validate_fields
    check(self)
  File "/data/build/ingadhoc/stock/stock_ux/models/stock_move_line.py", line 91, in _check_quantity
    _('You can not transfer more than the initial demand!'))
odoo.exceptions.ValidationError: ('You can not transfer more than the initial demand!', None)
2021-02-15 11:23:23 ERROR server odoo.addons.stock.tests.test_packing:665
ERROR: TestPacking.test_partial_put_in_pack
Traceback (most recent call last):
  File "/data/build/odoo/addons/stock/tests/test_packing.py", line 665, in test_partial_put_in_pack
    first_pack = pick_picking.put_in_pack()
  File "/data/build/odoo/addons/stock/models/stock_picking.py", line 1257, in put_in_pack
    res = self._put_in_pack(move_line_ids)
  File "/data/build/odoo/addons/stock/models/stock_picking.py", line 1213, in _put_in_pack
    default={'product_uom_qty': 0, 'qty_done': ml.qty_done})
  File "/data/build/odoo/odoo/models.py", line 4664, in copy
    new = self.with_context(lang=None).create(vals)
  File "<decorator-gen-280>", line 2, in create
  File "/data/build/odoo/odoo/api.py", line 335, in _model_create_multi
    return create(self, [arg])
  File "/data/build/odoo/addons/stock_account/models/stock_move_line.py", line 16, in create
    move_lines = super(StockMoveLine, self).create(vals_list)
  File "<decorator-gen-228>", line 2, in create
  File "/data/build/odoo/odoo/api.py", line 336, in _model_create_multi
    return create(self, arg)
  File "/data/build/odoo/addons/stock/models/stock_move_line.py", line 211, in create
    mls = super(StockMoveLine, self).create(vals_list)
  File "<decorator-gen-3>", line 2, in create
  File "/data/build/odoo/odoo/api.py", line 336, in _model_create_multi
    return create(self, arg)
  File "/data/build/odoo/odoo/models.py", line 3810, in create
    records = self._create(data_list)
  File "/data/build/odoo/odoo/models.py", line 3983, in _create
    records._validate_fields(name for data in data_list for name in data['stored'])
  File "/data/build/odoo/odoo/models.py", line 1206, in _validate_fields
    check(self)
  File "/data/build/ingadhoc/stock/stock_ux/models/stock_move_line.py", line 87, in _check_quantity
    self.mapped('move_id')._check_quantity()
  File "/data/build/ingadhoc/stock/stock_ux/models/stock_move.py", line 54, in _check_quantity
    'You can not transfer more than the initial demand!'))
odoo.exceptions.ValidationError: ('You can not transfer more than the initial demand!', None)
2021-02-15 11:23:23 ERROR server odoo.addons.stock.tests.test_packing:246
ERROR: TestPacking.test_put_in_pack_to_different_location
Traceback (most recent call last):
  File "/data/build/odoo/addons/stock/tests/test_packing.py", line 246, in test_put_in_pack_to_different_location
    'state': 'confirmed',
  File "/data/build/odoo/addons/stock/models/stock_picking.py", line 603, in write
    res = super(Picking, self).write(vals)
  File "/data/build/odoo/addons/mail/models/mail_thread.py", line 323, in write
    result = super(MailThread, self).write(values)
  File "/data/build/odoo/addons/mail/models/mail_activity.py", line 726, in write
    return super(MailActivityMixin, self).write(vals)
  File "/data/build/odoo/odoo/models.py", line 3610, in write
    field.write(self, vals[fname])
  File "/data/build/odoo/odoo/fields.py", line 2899, in write
    return self.write_batch([(records, value)])
  File "/data/build/odoo/odoo/fields.py", line 2920, in write_batch
    return self.write_real(records_commands_list, create)
  File "/data/build/odoo/odoo/fields.py", line 3093, in write_real
    flush()
  File "/data/build/odoo/odoo/fields.py", line 3057, in flush
    comodel.create(to_create)
  File "<decorator-gen-280>", line 2, in create
  File "/data/build/odoo/odoo/api.py", line 336, in _model_create_multi
    return create(self, arg)
  File "/data/build/odoo/addons/stock_account/models/stock_move_line.py", line 16, in create
    move_lines = super(StockMoveLine, self).create(vals_list)
  File "<decorator-gen-228>", line 2, in create
  File "/data/build/odoo/odoo/api.py", line 336, in _model_create_multi
    return create(self, arg)
  File "/data/build/odoo/addons/stock/models/stock_move_line.py", line 211, in create
    mls = super(StockMoveLine, self).create(vals_list)
  File "<decorator-gen-3>", line 2, in create
  File "/data/build/odoo/odoo/api.py", line 336, in _model_create_multi
    return create(self, arg)
  File "/data/build/odoo/odoo/models.py", line 3810, in create
    records = self._create(data_list)
  File "/data/build/odoo/odoo/models.py", line 3983, in _create
    records._validate_fields(name for data in data_list for name in data['stored'])
  File "/data/build/odoo/odoo/models.py", line 1206, in _validate_fields
    check(self)
  File "/data/build/ingadhoc/stock/stock_ux/models/stock_move_line.py", line 91, in _check_quantity
    _('You can not transfer more than the initial demand!'))
odoo.exceptions.ValidationError: ('You can not transfer more than the initial demand!', None)
2021-02-15 11:23:24 INFO server odoo.modules.module:613 odoo.addons.stock.tests.test_packing tested in 6.71s, 9896 queries
2021-02-15 11:23:24 ERROR server odoo.modules.module:616 Module stock: 0 failures, 4 errors
2021-02-15 11:23:30 INFO server odoo.addons.website.tests.test_crawl:70 public crawled 38 urls in 3.70s 3179 queries, 0.097s 83.66q per request,
2021-02-15 11:23:43 INFO server odoo.addons.website.tests.test_crawl:80 demo crawled 188 urls in 12.26s 11965 queries, 0.065s 63.64q per request
2021-02-15 11:24:07 INFO server odoo.addons.website.tests.test_crawl:90 admin crawled 261 urls in 24.15s 25942 queries, 0.093s 99.39q per request
2021-02-15 11:24:07 INFO server odoo.modules.module:613 odoo.addons.website.tests.test_crawl tested in 40.14s, 41092 queries
2021-02-15 11:24:13 INFO server odoo.modules.module:613 odoo.addons.website.tests.test_lang_url tested in 5.70s, 2520 queries
2021-02-15 11:25:08 INFO server odoo.modules.module:613 odoo.addons.website.tests.test_ui tested in 55.17s, 30495 queries
2021-02-15 11:25:26 INFO server odoo.modules.module:613 odoo.addons.website.tests.test_website_reset_password tested in 17.16s, 4494 queries
2021-02-15 11:25:26 WARNING server odoo.addons.account.tests.account_test_classes:20 Test skipped because there is no chart of account defined ...
2021-02-15 11:25:26 WARNING server odoo.addons.account.tests.account_test_classes:20 Test skipped because there is no chart of account defined ...
2021-02-15 11:25:26 WARNING server odoo.addons.account.tests.account_test_classes:20 Test skipped because there is no chart of account defined ...
2021-02-15 11:25:26 WARNING server odoo.addons.account.tests.account_test_classes:20 Test skipped because there is no chart of account defined ...
2021-02-15 11:25:26 WARNING server odoo.addons.account.tests.account_test_classes:20 Test skipped because there is no chart of account defined ...
2021-02-15 11:25:26 WARNING server odoo.addons.account.tests.account_test_classes:20 Test skipped because there is no chart of account defined ...
2021-02-15 11:25:26 WARNING server odoo.addons.account.tests.account_test_classes:20 Test skipped because there is no chart of account defined ...
2021-02-15 11:25:26 WARNING server odoo.addons.account.tests.account_test_classes:20 Test skipped because there is no chart of account defined ...
2021-02-15 11:25:26 WARNING server odoo.addons.account.tests.account_test_classes:20 Test skipped because there is no chart of account defined ...
2021-02-15 11:25:26 WARNING server odoo.addons.account.tests.account_test_classes:20 Test skipped because there is no chart of account defined ...
2021-02-15 11:25:26 WARNING server odoo.addons.account.tests.account_test_classes:20 Test skipped because there is no chart of account defined ...
2021-02-15 11:25:26 WARNING server odoo.addons.account.tests.account_test_classes:20 Test skipped because there is no chart of account defined ...
2021-02-15 11:25:26 WARNING server odoo.addons.account.tests.account_test_classes:20 Test skipped because there is no chart of account defined ...
2021-02-15 11:25:26 WARNING server odoo.addons.account.tests.account_test_classes:20 Test skipped because there is no chart of account defined ...
2021-02-15 11:25:26 WARNING server odoo.addons.account.tests.account_test_classes:20 Test skipped because there is no chart of account defined ...
2021-02-15 11:25:26 WARNING server odoo.addons.account.tests.account_test_classes:20 Test skipped because there is no chart of account defined ...
2021-02-15 11:25:26 WARNING server odoo.addons.account.tests.account_test_classes:20 Test skipped because there is no chart of account defined ...
2021-02-15 11:25:26 WARNING server odoo.addons.account.tests.account_test_classes:20 Test skipped because there is no chart of account defined ...
2021-02-15 11:25:26 WARNING server odoo.addons.account.tests.account_test_classes:20 Test skipped because there is no chart of account defined ...
2021-02-15 11:25:26 WARNING server odoo.addons.account.tests.account_test_classes:20 Test skipped because there is no chart of account defined ...
2021-02-15 11:25:26 WARNING server odoo.addons.account.tests.account_test_classes:20 Test skipped because there is no chart of account defined ...
2021-02-15 11:25:26 WARNING server odoo.addons.account.tests.account_test_classes:20 Test skipped because there is no chart of account defined ...
2021-02-15 11:25:26 WARNING server odoo.addons.account.tests.account_test_classes:20 Test skipped because there is no chart of account defined ...
2021-02-15 11:25:26 WARNING server odoo.addons.account.tests.account_test_classes:20 Test skipped because there is no chart of account defined ...
2021-02-15 11:25:27 WARNING server odoo.addons.account.tests.account_test_classes:20 Test skipped because there is no chart of account defined ...
2021-02-15 11:25:27 WARNING server odoo.addons.account.tests.account_test_classes:20 Test skipped because there is no chart of account defined ...
2021-02-15 11:25:27 WARNING server odoo.addons.account.tests.account_test_classes:20 Test skipped because there is no chart of account defined ...
2021-02-15 11:25:27 WARNING server odoo.addons.account.tests.account_test_classes:20 Test skipped because there is no chart of account defined ...
2021-02-15 11:25:27 ERROR server odoo.addons.account.tests.test_portal_attachment:27
ERROR: TestUi.test_01_portal_attachment
Traceback (most recent call last):
  File "/data/build/odoo/odoo/tools/misc.py", line 849, in deco
    return func(*args, **kwargs)
  File "/data/build/odoo/addons/account/tests/test_portal_attachment.py", line 27, in test_01_portal_attachment
    'invoice_line_ids': [(0, 0, {'name': 'aaaa', 'price_unit': 100.0})],
  File "<decorator-gen-277>", line 2, in create
  File "/data/build/odoo/odoo/api.py", line 335, in _model_create_multi
    return create(self, [arg])
  File "/data/build/odoo/addons/purchase/models/account_invoice.py", line 104, in create
    moves = super(AccountMove, self).create(vals_list)
  File "<decorator-gen-263>", line 2, in create
  File "/data/build/odoo/odoo/api.py", line 336, in _model_create_multi
    return create(self, arg)
  File "/data/build/odoo/addons/account/models/account_move.py", line 1706, in create
    vals_list = self._move_autocomplete_invoice_lines_create(vals_list)
  File "/data/build/odoo/addons/account/models/account_move.py", line 1670, in _move_autocomplete_invoice_lines_create
    new_vals = self_ctx._add_missing_default_values(vals)
  File "/data/build/odoo/odoo/models.py", line 1792, in _add_missing_default_values
    defaults = self.default_get(list(missing_defaults))
  File "/data/build/odoo/addons/utm/models/utm_mixin.py", line 22, in default_get
    values = super(UtmMixin, self).default_get(fields)
  File "/data/build/odoo/odoo/models.py", line 1244, in default_get
    defaults[name] = field.default(self)
  File "/data/build/odoo/addons/account/models/account_move.py", line 85, in _get_default_currency
    journal = self._get_default_journal()
  File "/data/build/odoo/addons/account/models/account_move.py", line 75, in _get_default_journal
    raise UserError(error_msg)
odoo.exceptions.UserError: ('Please define an accounting sale journal in your company', '')
2021-02-15 11:25:27 ERROR server odoo.modules.module:616 Module account: 0 failures, 1 errors
2021-02-15 11:25:27 WARNING server odoo.addons.account.tests.account_test_classes:20 Test skipped because there is no chart of account defined ...
2021-02-15 11:25:27 WARNING server odoo.addons.account.tests.account_test_classes:20 Test skipped because there is no chart of account defined ...
2021-02-15 11:25:27 WARNING server odoo.addons.account.tests.account_test_classes:20 Test skipped because there is no chart of account defined ...
2021-02-15 11:25:27 WARNING server odoo.addons.account.tests.account_test_classes:20 Test skipped because there is no chart of account defined ...
2021-02-15 11:25:27 WARNING server odoo.addons.account.tests.account_test_classes:20 Test skipped because there is no chart of account defined ...
2021-02-15 11:25:27 WARNING server odoo.addons.account.tests.account_test_classes:20 Test skipped because there is no chart of account defined ...
2021-02-15 11:25:27 WARNING server odoo.addons.account.tests.account_test_classes:20 Test skipped because there is no chart of account defined ...
2021-02-15 11:25:27 WARNING server odoo.addons.account.tests.account_test_classes:20 Test skipped because there is no chart of account defined ...
2021-02-15 11:25:27 WARNING server odoo.addons.account.tests.account_test_classes:20 Test skipped because there is no chart of account defined ...
2021-02-15 11:25:27 WARNING server odoo.addons.account.tests.account_test_classes:20 Test skipped because there is no chart of account defined ...
2021-02-15 11:25:27 WARNING server odoo.addons.account.tests.account_test_classes:20 Test skipped because there is no chart of account defined ...
2021-02-15 11:25:27 Log limit reached (full logs are still available in the log file)
2021-02-15 11:29:53 INFO runbot Getting results for build 00054-13-0
2021-02-15 11:29:53 Step all finished in 17m
2021-02-15 11:29:53 Starting step run from config Adhoc Conf
2021-02-15 11:29:53 INFO runbot Start running build 00054-13-0
2021-02-15 11:30:19 INFO server odoo.modules.loading:279 1 modules loaded in 0.01s, 0 queries
2021-02-15 11:30:20 INFO server odoo.modules.loading:279 167 modules loaded in 1.21s, 0 queries
2021-02-15 11:47:16 ERROR runbot Docker with state GHOST not started after 60 seconds, skipping
2021-02-15 11:47:16 INFO runbot Step run finished in 17m